1-Ethynyl-1-cyclooctanol
- Formula: C10H16O
- Molecular weight: 152.2334
- IUPAC Standard InChIKey: DHAPUKCAOFQTIT-UHFFFAOYSA-N
- CAS Registry Number: 55373-76-7
- Chemical structure:
View 3d structure (requires JavaScript / HTML 5) - Other names: Cyclooctanol, 1-ethynyl-; 1-Aethinyl-cyclooctanol-(1); 1-Ethynylcyclooctanol

Phase change data

Data compiled by: Robert L. Brown and Stephen E. Stein
Reduced pressure boiling point
Tboil (K) | Pressure (bar) | Reference |
---|---|---|
377. to 379. | 0.016 | Farchan Laboratories, 1990 |

References

Farchan Laboratories, 1990
Farchan Laboratories,
Research Chemicals Catalog, Farchan Laboratories, Gainesville, FL, 1990, 91. [all data]