1,1'-Bicyclopentyl, 2-hexadecyl-
- Formula: C26H50
- Molecular weight: 362.6752
- IUPAC Standard InChIKey: ZENJJKDYBBKFAI-UHFFFAOYSA-N
- CAS Registry Number: 55334-11-7
- Chemical structure:

Phase change data

Data compiled as indicated in comments:
TRC - Thermodynamics Research Center, NIST Boulder Laboratories, Chris Muzny director
AC - William E. Acree, Jr., James S. Chickos
Quantity | Value | Units | Method | Reference | Comment |
---|---|---|---|---|---|
Tfus | 291.9 | K | N/A | Foehr and Fenske, 1949 | Uncertainty assigned by TRC = 2. K; TRC |
Tfus | 291.9 | K | N/A | Schiessler, 1947 | Uncertainty assigned by TRC = 0.5 K; TRC |
Enthalpy of vaporization
ΔvapH (kJ/mol) | Temperature (K) | Method | Reference | Comment |
---|---|---|---|---|
97.7 | 510. | A,MG | Stephenson and Malanowski, 1987 | Based on data from 495. to 532. K. See also Schiessler and Whitmore, 1955.; AC |

References

Foehr and Fenske, 1949
Foehr, E.G.; Fenske, M.R.,
Magneto-optic Rotation of Hydrocarbons,
Ind. Eng. Chem., 1949, 41, 1956. [all data]
Schiessler, 1947
Schiessler, R.W.,
, Am. Pet. Inst. Res. Proj. 42, Twelfth Meeting, 1947. [all data]
Stephenson and Malanowski, 1987
Stephenson, Richard M.; Malanowski, Stanislaw,
Handbook of the Thermodynamics of Organic Compounds, 1987, https://doi.org/10.1007/978-94-009-3173-2
. [all data]
Schiessler and Whitmore, 1955
Schiessler, R.W.; Whitmore, F.C.,
Properties of High Molecular Weight Hydrocarbons,
Ind. Eng. Chem., 1955, 47, 8, 1660-1665, https://doi.org/10.1021/ie50548a054
. [all data]