Docosane, 9-octyl-

Phase change data

Data compiled as indicated in comments:
TRC - Thermodynamics Research Center, NIST Boulder Laboratories, Chris Muzny director
AC - William E. Acree, Jr., James S. Chickos

Quantity Value Units Method Reference Comment
Tfus281.8KN/AFoehr and Fenske, 1949Uncertainty assigned by TRC = 1. K; TRC
Tfus281.8KN/AWhitmore, Sutherland, et al., 1942Uncertainty assigned by TRC = 1.5 K; TRC

Enthalpy of vaporization

ΔvapH (kJ/mol) Temperature (K) Method Reference Comment
109.3533.AStephenson and Malanowski, 1987Based on data from 518. - 588. K.; AC

In addition to the Thermodynamics Research Center (TRC) data available from this site, much more physical and chemical property data is available from the following TRC products:

References

Foehr and Fenske, 1949
Foehr, E.G.; Fenske, M.R., Magneto-optic Rotation of Hydrocarbons, Ind. Eng. Chem., 1949, 41, 1956. [all data]

Whitmore, Sutherland, et al., 1942
Whitmore, F.C.; Sutherland, L.H.; Cosby, J.N., Higher Hydrocarbons. I. Seven Alkyl Substituted Docosanes., J. Am. Chem. Soc., 1942, 64, 1360. [all data]

Stephenson and Malanowski, 1987
Stephenson, Richard M.; Malanowski, Stanislaw, Handbook of the Thermodynamics of Organic Compounds, 1987, https://doi.org/10.1007/978-94-009-3173-2 . [all data]