Dl 3,3'-bis(cyclopentenyl)
- Formula: C10H14
- Molecular weight: 134.2182
- IUPAC Standard InChIKey: VJEREEILRKZBKE-UHFFFAOYSA-N
- CAS Registry Number: 5530-97-2
- Chemical structure:
View 3d structure (requires JavaScript / HTML 5) - Species with the same structure:

Reaction thermochemistry data

Data compiled by: Hussein Y. Afeefy, Joel F. Liebman, and Stephen E. Stein
Individual Reactions
By formula: 2H2 + C10H14 = C10H18
Quantity | Value | Units | Method | Reference | Comment |
---|---|---|---|---|---|
ΔrH° | -228. ± 0.4 | kJ/mol | Chyd | Roth, Adamczak, et al., 1991 | liquid phase |

References

Roth, Adamczak, et al., 1991
Roth, W.R.; Adamczak, O.; Breuckmann, R.; Lennartz, H.-W.; Boese, R.,
Die Berechnung von Resonanzenergien; das MM2ERW-Kraftfeld,
Chem. Ber., 1991, 124, 2499-2521. [all data]