Ethanone, 1,2-di-2-furanyl-2-hydroxy-
- Formula: C10H8O4
- Molecular weight: 192.1681
- IUPAC Standard InChIKey: MIJRFWVFNKQQDK-UHFFFAOYSA-N
- CAS Registry Number: 552-86-3
- Chemical structure:
View 3d structure (requires JavaScript / HTML 5) - Other names: Furoin; α-Furoin; Ketone, 2-furyl α-hydroxyfurfuryl; Ethanone, 1,2-di-2-furyl-2-hydroxy-; 2,2'-furoin

Condensed phase thermochemistry data

Data compiled by: Hussein Y. Afeefy, Joel F. Liebman, and Stephen E. Stein
Quantity | Value | Units | Method | Reference | Comment |
---|---|---|---|---|---|
ΔcH°solid | -4661.0 | kJ/mol | Ccb | Barker, 1925 | Author was aware that data differs from previously reported values; Corresponding ΔfHºsolid = -418. kJ/mol (simple calculation by NIST; no Washburn corrections) |

Phase change data

Data compiled by: Thermodynamics Research Center, NIST Boulder Laboratories, Chris Muzny director
Quantity | Value | Units | Method | Reference | Comment |
---|---|---|---|---|---|
Tfus | 408. | K | N/A | Buck and Jenkins, 1929 | Uncertainty assigned by TRC = 3. K |

Normal alkane RI, non-polar column, temperature ramp

Column type | Active phase | I | Reference | Comment |
---|---|---|---|---|
Packed | OV-101 | 1449. | Zenkevich, Acevedo, et al., 1991 | Celite 545 (0.20-0.25 mm), 10. K/min; Column length: 1.2 m; Tstart: 100. C; Tend: 300. C |

References

Barker, 1925
Barker, M.F.,
Calorific value and constitution,
J. Phys. Chem., 1925, 29, 1345-1363. [all data]
Buck and Jenkins, 1929
Buck, J.S.; Jenkins, S.S.,
Catalytic Reduction of Alpha-Diketones and Their Derivatives,
J. Am. Chem. Soc., 1929, 51, 2163. [all data]
Zenkevich, Acevedo, et al., 1991
Zenkevich, I.G.; Acevedo, J.M.; Aguilera, I.R.,
Increments of Gas Chromatographic Retention Indices for Characterization of Organic Reactions,
Vestn. St. Petersb. Univ. Ser. 4: Fiz. Khim, 1991, 2, 51-56. [all data]