Benzene, 1,3,5-trimethyl-2-octadecyl-
- Formula: C27H48
- Molecular weight: 372.6700
- IUPAC Standard InChIKey: SDJSEINVDXJJCL-UHFFFAOYSA-N
- CAS Registry Number: 55282-67-2
- Chemical structure:
View 3d structure (requires JavaScript / HTML 5) - Other names: 1-(2,4,6-Trimethylphenyl)octadecane; 1,3,5-Trimethyl-2-n-octadecylbenzene; 2,4,6-Trimethyl-n-octadecylbenzene

Phase change data

Data compiled by: Thermodynamics Research Center, NIST Boulder Laboratories, Chris Muzny director
Quantity | Value | Units | Method | Reference | Comment |
---|---|---|---|---|---|
Tfus | 327.55 | K | N/A | Anonymous, 1968 | Uncertainty assigned by TRC = 0.5 K |

References

Anonymous, 1968
Anonymous, R.,
Properties of hydrocarbon of high molecular weight, Am. Pet. Inst. Res. Proj. 42, Penn. State Univ., 1968. [all data]