Eicosane, 10-hexyl-10-methyl-
- Formula: C27H56
- Molecular weight: 380.7335
- IUPAC Standard InChIKey: SHJTUYDWGDNRHW-UHFFFAOYSA-N
- CAS Registry Number: 55282-32-1
- Chemical structure:
View 3d structure (requires JavaScript / HTML 5) - Other names: 10-Hexyl-10-methyleicosane

Phase change data

Data compiled as indicated in comments:
TRC - Thermodynamics Research Center, NIST Boulder Laboratories, Chris Muzny director
AC - William E. Acree, Jr., James S. Chickos
Quantity | Value | Units | Method | Reference | Comment |
---|---|---|---|---|---|
Tfus | 188. | K | N/A | Rabjohn, 1955 | Uncertainty assigned by TRC = 3. K; TRC |
Quantity | Value | Units | Method | Reference | Comment |
ΔvapH° | 129.9 ± 1.8 | kJ/mol | CGC | Chickos, Hesse, et al., 1995 | AC |

References

Rabjohn, 1955
Rabjohn, N.,
Unpublished, Univ. of Missouri, Columbus, 1955. [all data]
Chickos, Hesse, et al., 1995
Chickos, James S.; Hesse, Donald G.; Hosseini, Sarah; Liebman, Joel F.; David Mendenhall, G.; Verevkin, Sergej P.; Rakus, Klaus; Beckhaus, Hans-Dieter; Rüchardt, Christoph,
Enthalpies of vaporization of some highly branched hydrocarbons,
The Journal of Chemical Thermodynamics, 1995, 27, 6, 693-705, https://doi.org/10.1006/jcht.1995.0071
. [all data]