Octadecane, 9-ethyl-9-heptyl-
- Formula: C27H56
- Molecular weight: 380.7335
- IUPAC Standard InChIKey: LRJHOBBNMAGOIG-UHFFFAOYSA-N
- CAS Registry Number: 55282-27-4
- Chemical structure:

Phase change data

Data compiled by: Thermodynamics Research Center, NIST Boulder Laboratories, Chris Muzny director
Quantity | Value | Units | Method | Reference | Comment |
---|---|---|---|---|---|
Tfus | 193. | K | N/A | Rabjohn, 1955 | Uncertainty assigned by TRC = 5. K |

References

Rabjohn, 1955
Rabjohn, N.,
Unpublished, Univ. of Missouri, Columbus, 1955. [all data]