Tetracosane, 3-ethyl-
- Formula: C26H54
- Molecular weight: 366.7070
- IUPAC Standard InChIKey: HCYGJXYCUXDCHD-UHFFFAOYSA-N
- CAS Registry Number: 55282-17-2
- Chemical structure:

Phase change data

Data compiled as indicated in comments:
TRC - Thermodynamics Research Center, NIST Boulder Laboratories, Chris Muzny director
AC - William E. Acree, Jr., James S. Chickos
Quantity | Value | Units | Method | Reference | Comment |
---|---|---|---|---|---|
Tfus | 303.25 | K | N/A | Anonymous, 1968 | TRC |
Tfus | 303.3 | K | N/A | Anonymous, 1952 | Uncertainty assigned by TRC = 0.5 K; TRC |
Enthalpy of vaporization
ΔvapH (kJ/mol) | Temperature (K) | Method | Reference | Comment |
---|---|---|---|---|
90. | 505. | A | Stephenson and Malanowski, 1987 | Based on data from 490. to 529. K.; AC |

Kovats' RI, non-polar column, isothermal

Column type | Active phase | Temperature (C) | I | Reference | Comment |
---|---|---|---|---|---|
Capillary | Dexsil 300 | 220. | 2567. | Szafranek, Kusmierz, et al., 1982 | He; Column length: 30. m; Column diameter: 0.30 mm |

References

Anonymous, 1968
Anonymous, R.,
Properties of hydrocarbon of high molecular weight, Am. Pet. Inst. Res. Proj. 42, Penn. State Univ., 1968. [all data]
Anonymous, 1952
Anonymous, R.,
, Physical Properties of Chemical Substances, Dow Chemical Co., 1952. [all data]
Stephenson and Malanowski, 1987
Stephenson, Richard M.; Malanowski, Stanislaw,
Handbook of the Thermodynamics of Organic Compounds, 1987, https://doi.org/10.1007/978-94-009-3173-2
. [all data]
Szafranek, Kusmierz, et al., 1982
Szafranek, J.; Kusmierz, J.; Czerwiec, W.,
Gas chromatographic-mass spectrometric investigations of high-boiling crude oil alkane fractions,
J. Chromatogr., 1982, 245, 2, 219-228, https://doi.org/10.1016/S0021-9673(00)88591-X
. [all data]