Octadecane, 5,14-dibutyl-
- Formula: C26H54
- Molecular weight: 366.7070
- IUPAC Standard InChIKey: VZZCEMBCJSFMMD-UHFFFAOYSA-N
- CAS Registry Number: 55282-13-8
- Chemical structure:
View 3d structure (requires JavaScript / HTML 5) - Other names: 5,14-Di-n-butyloctadecane; 5,14-Dibutyloctadecane

Phase change data

Data compiled as indicated in comments:
TRC - Thermodynamics Research Center, NIST Boulder Laboratories, Chris Muzny director
AC - William E. Acree, Jr., James S. Chickos
Quantity | Value | Units | Method | Reference | Comment |
---|---|---|---|---|---|
Tfus | 278.85 | K | N/A | Anonymous, 1968 | TRC |
Tfus | 278.9 | K | N/A | Schiessler and Whitmore, 1955 | Uncertainty assigned by TRC = 0.5 K; TRC |
Tfus | 278.9 | K | N/A | Foehr and Fenske, 1949 | Uncertainty assigned by TRC = 2. K; TRC |
Tfus | 278.9 | K | N/A | Schiessler, 1947 | Uncertainty assigned by TRC = 0.5 K; TRC |
Enthalpy of vaporization
ΔvapH (kJ/mol) | Temperature (K) | Method | Reference | Comment |
---|---|---|---|---|
89.3 | 473. | A,MG | Stephenson and Malanowski, 1987 | Based on data from 458. to 508. K. See also Schiessler and Whitmore, 1955, 2.; AC |

References

Anonymous, 1968
Anonymous, R.,
Properties of hydrocarbon of high molecular weight, Am. Pet. Inst. Res. Proj. 42, Penn. State Univ., 1968. [all data]
Schiessler and Whitmore, 1955
Schiessler, R.W.; Whitmore, F.C.,
Ind. Eng. Chem., 1955, 47, 1660. [all data]
Foehr and Fenske, 1949
Foehr, E.G.; Fenske, M.R.,
Magneto-optic Rotation of Hydrocarbons,
Ind. Eng. Chem., 1949, 41, 1956. [all data]
Schiessler, 1947
Schiessler, R.W.,
, Am. Pet. Inst. Res. Proj. 42, Twelfth Meeting, 1947. [all data]
Stephenson and Malanowski, 1987
Stephenson, Richard M.; Malanowski, Stanislaw,
Handbook of the Thermodynamics of Organic Compounds, 1987, https://doi.org/10.1007/978-94-009-3173-2
. [all data]
Schiessler and Whitmore, 1955, 2
Schiessler, R.W.; Whitmore, F.C.,
Properties of High Molecular Weight Hydrocarbons,
Ind. Eng. Chem., 1955, 47, 8, 1660-1665, https://doi.org/10.1021/ie50548a054
. [all data]