Heneicosane, 11-(2,2-dimethylpropyl)-
- Formula: C26H54
- Molecular weight: 366.7070
- IUPAC Standard InChIKey: JOPYPDXSWNGCTB-UHFFFAOYSA-N
- CAS Registry Number: 55282-10-5
- Chemical structure:
View 3d structure (requires JavaScript / HTML 5) - Other names: 11-(2',2'-Dimethylpropyl)heneicosane; 11-Neopentylheneicosane

Phase change data

Data compiled as indicated in comments:
TRC - Thermodynamics Research Center, NIST Boulder Laboratories, Chris Muzny director
AC - William E. Acree, Jr., James S. Chickos
Quantity | Value | Units | Method | Reference | Comment |
---|---|---|---|---|---|
Tfus | 252.15 | K | N/A | Anonymous, 1968 | TRC |
Tfus | 252.2 | K | N/A | Foehr and Fenske, 1949 | Uncertainty assigned by TRC = 2. K; TRC |
Tfus | 252.2 | K | N/A | Schiessler, 1947 | Uncertainty assigned by TRC = 1. K; TRC |
Enthalpy of vaporization
ΔvapH (kJ/mol) | Temperature (K) | Method | Reference | Comment |
---|---|---|---|---|
93. | 491. | A,MG | Stephenson and Malanowski, 1987 | Based on data from 476. to 511. K. See also Schiessler and Whitmore, 1955.; AC |

References

Anonymous, 1968
Anonymous, R.,
Properties of hydrocarbon of high molecular weight, Am. Pet. Inst. Res. Proj. 42, Penn. State Univ., 1968. [all data]
Foehr and Fenske, 1949
Foehr, E.G.; Fenske, M.R.,
Magneto-optic Rotation of Hydrocarbons,
Ind. Eng. Chem., 1949, 41, 1956. [all data]
Schiessler, 1947
Schiessler, R.W.,
, Am. Pet. Inst. Res. Proj. 42, Twelfth Meeting, 1947. [all data]
Stephenson and Malanowski, 1987
Stephenson, Richard M.; Malanowski, Stanislaw,
Handbook of the Thermodynamics of Organic Compounds, 1987, https://doi.org/10.1007/978-94-009-3173-2
. [all data]
Schiessler and Whitmore, 1955
Schiessler, R.W.; Whitmore, F.C.,
Properties of High Molecular Weight Hydrocarbons,
Ind. Eng. Chem., 1955, 47, 8, 1660-1665, https://doi.org/10.1021/ie50548a054
. [all data]