Benzene, 1,1'-tetradecylidenebis-
- Formula: C26H38
- Molecular weight: 350.5799
- IUPAC Standard InChIKey: RHISRDQWNQEBBY-UHFFFAOYSA-N
- CAS Registry Number: 55268-63-8
- Chemical structure:

Phase change data

Data compiled as indicated in comments:
TRC - Thermodynamics Research Center, NIST Boulder Laboratories, Chris Muzny director
AC - William E. Acree, Jr., James S. Chickos
Quantity | Value | Units | Method | Reference | Comment |
---|---|---|---|---|---|
Tfus | 291.1 | K | N/A | Schiessler, 1947 | Uncertainty assigned by TRC = 1. K; TRC |
Tfus | 291.1 | K | N/A | Cosby and Sutherland, 1941 | Uncertainty assigned by TRC = 0.6 K; TRC |
Enthalpy of vaporization
ΔvapH (kJ/mol) | Temperature (K) | Method | Reference | Comment |
---|---|---|---|---|
98.2 | 482. | A | Stephenson and Malanowski, 1987 | Based on data from 467. to 530. K.; AC |

References

Schiessler, 1947
Schiessler, R.W.,
, Am. Pet. Inst. Res. Proj. 42, Twelfth Meeting, 1947. [all data]
Cosby and Sutherland, 1941
Cosby, J.N.; Sutherland, L.H.,
The Synthesis and Properteis of Hydrocarbons of High Molecular Weight,
Proc., Am. Pet. Inst., Sect. 3, 1941, 22, 13. [all data]
Stephenson and Malanowski, 1987
Stephenson, Richard M.; Malanowski, Stanislaw,
Handbook of the Thermodynamics of Organic Compounds, 1987, https://doi.org/10.1007/978-94-009-3173-2
. [all data]