Tetratriacontane, 17-hexadecyl-
- Formula: C50H102
- Molecular weight: 703.3449
- IUPAC Standard InChIKey: DAQUEPISOMDKQG-UHFFFAOYSA-N
- CAS Registry Number: 55256-07-0
- Chemical structure:

Phase change data

Data compiled by: Thermodynamics Research Center, NIST Boulder Laboratories, Chris Muzny director
Quantity | Value | Units | Method | Reference | Comment |
---|---|---|---|---|---|
Tfus | 317.0 | K | N/A | Anonymous, 1952 | Uncertainty assigned by TRC = 2. K |

References

Anonymous, 1952
Anonymous, R.,
, Physical Properties of Chemical Substances, Dow Chemical Co., 1952. [all data]