Naphthalene, 1,2,3,4-tetrahydro-2,6-dimethyl-7-octyl-
- Formula: C20H32
- Molecular weight: 272.4681
- IUPAC Standard InChIKey: QXCGTKPQXLLOQZ-UHFFFAOYSA-N
- CAS Registry Number: 55255-59-9
- Chemical structure:
View 3d structure (requires JavaScript / HTML 5) - Other names: 1,2,3,4-Tetrahydro-2,6-dimethyl-7-octylnaphthalene

Phase change data

Data compiled by: William E. Acree, Jr., James S. Chickos
Enthalpy of vaporization
ΔvapH (kJ/mol) | Temperature (K) | Reference | Comment |
---|---|---|---|
79.4 | 433. | Dixon, Yarnell, et al., 1963 | Based on data from 418. to 480. K. See also Boublik, Fried, et al., 1984 and Dykyj, Svoboda, et al., 1999. |

References

Dixon, Yarnell, et al., 1963
Dixon, Joseph A.; Yarnell, G.R.; Mountain, J.A.,
Physical Properties of Twelve Isomeric Alkyl-Substituted Naphthalenes, Tetrahydronaphthalenes, and Decahydronaphthalenes.,
J. Chem. Eng. Data, 1963, 8, 4, 572-573, https://doi.org/10.1021/je60019a030
. [all data]
Boublik, Fried, et al., 1984
Boublik, T.; Fried, V.; Hala, E.,
The Vapour Pressures of Pure Substances: Selected Values of the Temperature Dependence of the Vapour Pressures of Some Pure Substances in the Normal and Low Pressure Region, 2nd ed., Elsevier, New York, 1984, 972. [all data]
Dykyj, Svoboda, et al., 1999
Dykyj, J.; Svoboda, J.; Wilhoit, R.C.; Frenkel, M.L.; Hall, K.R.,
Vapor Pressure of Chemicals: Part A. Vapor Pressure and Antoine Constants for Hydrocarbons and Sulfur, Selenium, Tellurium and Hydrogen Containing Organic Compounds, Springer, Berlin, 1999, 373. [all data]