2-Pentenedioic acid, 2TMS derivative
- Formula: C11H22O4Si2
- Molecular weight: 274.4610
- IUPAC Standard InChIKey: XYCDBRYVUTZVCR-BQYQJAHWSA-N
- CAS Registry Number: 55255-43-1
- Chemical structure:
View 3d structure (requires JavaScript / HTML 5) - Stereoisomers:
- Other names: 2-Pentenedioic acid, bis(trimethylsilyl) ester; Glutaconic acid, di(trimethylsilyl) ester; Bis(trimethylsilyl) 2-pentenedioate; Glutaconic acid, bis-TMS; Glutaconic acid, di-TMS; Glutaconic acid, TMS # 2

Van Den Dool and Kratz RI, non-polar column, temperature ramp

Column type | Active phase | I | Reference | Comment |
---|---|---|---|---|
Capillary | DB-5 | 1448. | Kimura, Yamamoto, et al., 1999 | 30. m/0.25 mm/1. μm, He, 100. C @ 4. min, 4. K/min, 290. C @ 10. min |
Capillary | SE-52 | 1453. | Lefevere, Verhaeghe, et al., 1989 | 25. m/0.32 mm/0.52 μm, He, 5. K/min; Tstart: 70. C; Tend: 270. C |
Capillary | Ultra-2 | 1456. | Tuchman, Bowers, et al., 1984 | 25. m/0.31 mm/0.52 μm, He, 5. K/min; Tstart: 50. C; Tend: 300. C |

Normal alkane RI, non-polar column, temperature ramp

Column type | Active phase | I | Reference | Comment |
---|---|---|---|---|
Capillary | HP-5MS | 1460. | Lee, Yanamandra, et al., 2002 | 30. m/0.25 mm/0.25 μm, He, 70. C @ 3. min, 4. K/min, 280. C @ 3. min |

References

Kimura, Yamamoto, et al., 1999
Kimura, M.; Yamamoto, T.; Yamaguchi, S.,
Automated metabolic profiling and interpretation of GC/MS data for organic acidemia screening: a personal computer-based system,
Tohoku J. Exp. Med., 1999, 188, 4, 317-334, https://doi.org/10.1620/tjem.188.317
. [all data]
Lefevere, Verhaeghe, et al., 1989
Lefevere, M.F.; Verhaeghe, B.J.; Declerck, D.H.; Van Bocxlaer, J.F.; De Leenheer, A.P.; De Sagher, R.M.,
Metabolic Profiling of Urinary Organic Acids by Single and Multicolumn Capillary Gas Chromatography,
J. Chromatogr. Sci., 1989, 27, 1, 23-29, https://doi.org/10.1093/chromsci/27.1.23
. [all data]
Tuchman, Bowers, et al., 1984
Tuchman, M.; Bowers, L.D.; Fregien, K.D.; Crippin, P.J.; Krivit, W.,
Capillary Gas Chromatographic Separation of Urinary Organic Acids. Retention Indices of 101 Urinary Acids on a 5% Phenylmethyl Silicone Capillary Column,
J. Chromatogr. Sci., 1984, 22, 5, 198-202, https://doi.org/10.1093/chromsci/22.5.198
. [all data]
Lee, Yanamandra, et al., 2002
Lee, B.Y.; Yanamandra, K.; Thurmon, T.F.,
Quantitative estimation of organic analytes with a capillary column,
Am. Clin. Lab., 2002, May, 30-34. [all data]