Benzoic acid, 2-nitro-
- Formula: C7H5NO4
- Molecular weight: 167.1189
- IUPAC Standard InChIKey: SLAMLWHELXOEJZ-UHFFFAOYSA-N
- CAS Registry Number: 552-16-9
- Chemical structure:
View 3d structure (requires JavaScript / HTML 5) - Other names: Benzoic acid, o-nitro-; o-Nitrobenzoic acid; 2-Nitrobenzoic acid

Condensed phase thermochemistry data

Data compiled as indicated in comments:
ALS - Hussein Y. Afeefy, Joel F. Liebman, and Stephen E. Stein
DH - Eugene S. Domalski and Elizabeth D. Hearing
Quantity | Value | Units | Method | Reference | Comment |
---|---|---|---|---|---|
ΔfH°solid | -399. ± 0.63 | kJ/mol | Ccb | Lebedeva, Ryadnenko, et al., 1971 | Hfusion=4.7±0.3, see Lebedeva, Rjadnenko, et al., 1969; ALS |
Quantity | Value | Units | Method | Reference | Comment |
ΔcH°solid | -3071. ± 0.63 | kJ/mol | Ccb | Lebedeva, Ryadnenko, et al., 1971 | Hfusion=4.7±0.3, see Lebedeva, Rjadnenko, et al., 1969; ALS |
ΔcH°solid | -3077.70 | kJ/mol | Ccb | Verkade, 1926 | ALS |
Constant pressure heat capacity of solid
Cp,solid (J/mol*K) | Temperature (K) | Reference | Comment |
---|---|---|---|
202.1 | 323. | Satoh and Sogabe, 1941 | T = 0 to 100 C. Mean value.; DH |
191.6 | 298. | Andrews, Lynn, et al., 1926 | T = 22 to 240 C.; DH |
190.0 | 297.9 | Andrews, 1926 | T = 110 to 344 K. Value is unsmoothed experimental datum.; DH |

Phase change data

Data compiled as indicated in comments:
TRC - Thermodynamics Research Center, NIST Boulder Laboratories, Chris Muzny director
AC - William E. Acree, Jr., James S. Chickos
DH - Eugene S. Domalski and Elizabeth D. Hearing
Quantity | Value | Units | Method | Reference | Comment |
---|---|---|---|---|---|
Tfus | 419.0 | K | N/A | Andrews, Lynn, et al., 1926, 2 | Uncertainty assigned by TRC = 0.3 K; TRC |
Quantity | Value | Units | Method | Reference | Comment |
ΔsubH° | 118.7 ± 0.5 | kJ/mol | ME | Ribeiro da Silva, 1999 | AC |
Enthalpy of sublimation
ΔsubH (kJ/mol) | Temperature (K) | Method | Reference | Comment |
---|---|---|---|---|
115.8 ± 0.5 | 356. | ME | Ribeiro da Silva, 1999 | Based on data from 346. to 356. K.; AC |
Enthalpy of fusion
ΔfusH (kJ/mol) | Temperature (K) | Reference | Comment |
---|---|---|---|
27.99 | 419. | Domalski and Hearing, 1996 | AC |
27.990 | 419.0 | Andrews, Lynn, et al., 1926 | DH |
Entropy of fusion
ΔfusS (J/mol*K) | Temperature (K) | Reference | Comment |
---|---|---|---|
66.8 | 419.0 | Andrews, Lynn, et al., 1926 | DH |

Reaction thermochemistry data

Data compiled by: John E. Bartmess
Individual Reactions
C7H4NO4- + =
By formula: C7H4NO4- + H+ = C7H5NO4
Quantity | Value | Units | Method | Reference | Comment |
---|---|---|---|---|---|
ΔrH° | 1388. ± 9.2 | kJ/mol | G+TS | Yamdagni, McMahon, et al., 1974 | gas phase |
Quantity | Value | Units | Method | Reference | Comment |
ΔrG° | 1357. ± 8.4 | kJ/mol | IMRE | Yamdagni, McMahon, et al., 1974 | gas phase |

Gas phase ion energetics data

Data compiled by: John E. Bartmess
De-protonation reactions
C7H4NO4- + =
By formula: C7H4NO4- + H+ = C7H5NO4
Quantity | Value | Units | Method | Reference | Comment |
---|---|---|---|---|---|
ΔrH° | 1388. ± 9.2 | kJ/mol | G+TS | Yamdagni, McMahon, et al., 1974 | gas phase |
Quantity | Value | Units | Method | Reference | Comment |
ΔrG° | 1357. ± 8.4 | kJ/mol | IMRE | Yamdagni, McMahon, et al., 1974 | gas phase |

References

Lebedeva, Ryadnenko, et al., 1971
Lebedeva, N.D.; Ryadnenko, V.L.; Kuznetsova, I.N.,
Heats of combustion and enthalpies of formation of certain aromatic nitro-derivatives,
Russ. J. Phys. Chem. (Engl. Transl.), 1971, 45, 549. [all data]
Lebedeva, Rjadnenko, et al., 1969
Lebedeva, N.D.; Rjadnenko, B.L.; Gutner, N.M.,
Heats of formation of some N-containing organic compounds,
Int. Conf. Calorim. Therm. (Warsaw, Poland), 1969, 1-8. [all data]
Verkade, 1926
Verkade, P.E.,
Verbrandingswarmten van plaatsings-isomere benzol-derivaten en de theorie der geinduceerde alterneeren de polatiteit,
Verslag Akad. Wetenschappen Amsterdam, 1926, 35, 492-504. [all data]
Satoh and Sogabe, 1941
Satoh, S.; Sogabe, T.,
The heat capacities of some organic compounds containing nitrogen and the atomic heat of nitrogen. (1), Sci.,
Pap. Inst. Phys. Chem. Res. (Tokyo), 1941, 38, 197-203. [all data]
Andrews, Lynn, et al., 1926
Andrews, D.H.; Lynn, G.; Johnston, J.,
The heat capacities and heat of crystallization of some isomeric aromatic compounds,
J. Am. Chem. Soc., 1926, 48, 1274-1287. [all data]
Andrews, 1926
Andrews, D.H.,
The specific heats of some isomers of the type ortho, meta and para C6H4XY from 110 to 340K,
J. Am. Chem. Soc., 1926, 48, 1287-1298. [all data]
Andrews, Lynn, et al., 1926, 2
Andrews, D.H.; Lynn, G.; Johnston, J.,
The Heat Capacities and Heat of Crystallization of Some Isomeric Aromatic Compounds,
J. Am. Chem. Soc., 1926, 48, 1274. [all data]
Ribeiro da Silva, 1999
Ribeiro da Silva, M.,
Enthalpies of combustion, vapour pressures, and enthalpies of sublimation of three methoxy-nitrobenzoic acids. Vapour pressures and enthalpies of sublimation of the three nitrobenzoic acids,
The Journal of Chemical Thermodynamics, 1999, 31, 11, 1429-1441, https://doi.org/10.1006/jcht.1999.0507
. [all data]
Domalski and Hearing, 1996
Domalski, Eugene S.; Hearing, Elizabeth D.,
Heat Capacities and Entropies of Organic Compounds in the Condensed Phase. Volume III,
J. Phys. Chem. Ref. Data, 1996, 25, 1, 1, https://doi.org/10.1063/1.555985
. [all data]
Yamdagni, McMahon, et al., 1974
Yamdagni, R.; McMahon, T.B.; Kebarle, P.,
Substituent Effects on the Intrinsic Acidities of Benzoic Acids Determined by Gas Phase Proton Transfer Equilibria Measurements,
J. Am. Chem. Soc., 1974, 96, 12, 4035, https://doi.org/10.1021/ja00819a063
. [all data]
Lang (editor), 1963
Lang (editor), L.,
Absorption Spectra in the Ultraviolet and Visible Region, 1963, 4, 97. [all data]