D-Xylulose
- Formula: C5H10O5
- Molecular weight: 150.1299
- IUPAC Standard InChIKey: LQXVFWRQNMEDEE-PYHARJCCSA-N
- CAS Registry Number: 551-84-8
- Chemical structure:
View 3d structure (requires JavaScript / HTML 5) - Other names: D-threo-2-Pentulose

Reaction thermochemistry data

Data compiled by: Hussein Y. Afeefy, Joel F. Liebman, and Stephen E. Stein
Individual Reactions
By formula: C5H10O5 = C5H10O5
Quantity | Value | Units | Method | Reference | Comment |
---|---|---|---|---|---|
ΔrH° | 16.09 ± 0.67 | kJ/mol | Ciso | Tewari, Steckler, et al., 1985 | liquid phase; solvent: Water |

References

Tewari, Steckler, et al., 1985
Tewari, Y.B.; Steckler, D.K.; Goldberg, R.N.,
Thermodynamics of the conversion of aqueous xylose to xylulose,
Biophys. Chem., 1985, 22, 181-185. [all data]