Pyrazine, 2-methyl-3-(2-propenyl)-
- Formula: C8H10N2
- Molecular weight: 134.1784
- IUPAC Standard InChIKey: AQCVFCFCPBWGSY-UHFFFAOYSA-N
- CAS Registry Number: 55138-62-0
- Chemical structure:
View 3d structure (requires JavaScript / HTML 5) - Other names: 2-Allyl-3-methylpyrazine

Normal alkane RI, polar column, temperature ramp

Column type | Active phase | I | Reference | Comment |
---|---|---|---|---|
Capillary | FFAP | 1739. | Budryn, Nebesny, et al., 2011 | 30. m/0.32 mm/0.50 μm, Nitrogen, 35. C @ 5. min, 4. K/min, 250. C @ 45. min |
Capillary | FFAP | 1739. | Nebesny, Budryn, et al., 2007 | 30. m/0.32 mm/0.5 μm, N2, 35. C @ 5. min, 4. K/min, 320. C @ 45. min |

References

Budryn, Nebesny, et al., 2011
Budryn, G.; Nebesny, E.; Kula, J.; Majda, T.; Krysiak, W.,
HS-SPME/GC/MS Profiles of convectively and microwave roasted Ivory Coast Robusta coffee brews,
Czech. J. Food Sci., 2011, 29, 2, 151-160. [all data]
Nebesny, Budryn, et al., 2007
Nebesny, E.; Budryn, G.; Kula, J.; Majda, T.,
The effect of roasting method on headspace composition of robusta coffee bean aroma,
Eur. Food Res. Technol., 2007, 225, 1, 9-19, https://doi.org/10.1007/s00217-006-0375-0
. [all data]