Heptadecane, 9-hexyl-
- Formula: C23H48
- Molecular weight: 324.6272
- IUPAC Standard InChIKey: ZUSMXUXZJCOSPV-UHFFFAOYSA-N
- CAS Registry Number: 55124-79-3
- Chemical structure:
View 3d structure (requires JavaScript / HTML 5) - Other names: 9-n-Hexylheptadecane; 9-Hexylheptadecane

Phase change data

Data compiled as indicated in comments:
TRC - Thermodynamics Research Center, NIST Boulder Laboratories, Chris Muzny director
AC - William E. Acree, Jr., James S. Chickos
Quantity | Value | Units | Method | Reference | Comment |
---|---|---|---|---|---|
Tfus | 253.75 | K | N/A | Anonymous, 1968 | TRC |
Tfus | 253.8 | K | N/A | Anonymous, 1952 | Uncertainty assigned by TRC = 0.6 K; TRC |
Enthalpy of vaporization
ΔvapH (kJ/mol) | Temperature (K) | Method | Reference | Comment |
---|---|---|---|---|
82.6 | 465. | A | Stephenson and Malanowski, 1987 | Based on data from 450. to 486. K.; AC |

References

Anonymous, 1968
Anonymous, R.,
Properties of hydrocarbon of high molecular weight, Am. Pet. Inst. Res. Proj. 42, Penn. State Univ., 1968. [all data]
Anonymous, 1952
Anonymous, R.,
, Physical Properties of Chemical Substances, Dow Chemical Co., 1952. [all data]
Stephenson and Malanowski, 1987
Stephenson, Richard M.; Malanowski, Stanislaw,
Handbook of the Thermodynamics of Organic Compounds, 1987, https://doi.org/10.1007/978-94-009-3173-2
. [all data]