5-Chloropentyl benzoate
- Formula: C12H15ClO2
- Molecular weight: 226.699
- IUPAC Standard InChIKey: XIOZPPYPTAEPGJ-UHFFFAOYSA-N
- CAS Registry Number: 55092-47-2
- Chemical structure:
View 3d structure (requires JavaScript / HTML 5) - Permanent link for this species. Use this link for bookmarking this species for future reference.

Phase change data

Data compiled by: Robert L. Brown and Stephen E. Stein
Reduced pressure boiling point
Tboil (K) | Pressure (bar) | Reference |
---|---|---|
411. to 414. | 0.0020 | Frinton Laboratories Inc., 1986 |

References

Frinton Laboratories Inc., 1986
Frinton Laboratories Inc.,
Catalog Number 11, Frinton Laboratories Inc., Vineland, NJ, 1986, 99. [all data]