dl-Isoleucine, ethyl ester
- Formula: C8H17NO2
- Molecular weight: 159.2261
- IUPAC Standard InChIKey: ICPWNTVICOHCML-UHFFFAOYSA-N
- CAS Registry Number: 55056-62-7
- Chemical structure:
View 3d structure (requires JavaScript / HTML 5) - Stereoisomers:
- Other names: Isoleucine ethyl ester

Normal alkane RI, non-polar column, temperature ramp

Column type | Active phase | I | Reference | Comment |
---|---|---|---|---|
Capillary | HP-5 MS | 1114. | Wanakhachornkrai and Lertsiri, 9999 | 30. m/0.25 mm/0.25 μm, Helium, 15. K/min; Tstart: 45. C; Tend: 280. C |

References

Wanakhachornkrai and Lertsiri, 9999
Wanakhachornkrai, P.; Lertsiri, S.,
Comparison of determination method for volatile compounds in Thai soy sauce,
Analytical, Nutritional and Clinical Methods, 9999, 1-11. [all data]