Cyclohexane, 1,1'-hexylidenebis-
- Formula: C18H34
- Molecular weight: 250.4626
- IUPAC Standard InChIKey: QDXQNQHDJRBQIE-UHFFFAOYSA-N
- CAS Registry Number: 55030-20-1
- Chemical structure:
View 3d structure (requires JavaScript / HTML 5) - Other names: 1,1-Dicyclohexylhexane

Condensed phase thermochemistry data

Data compiled by: Hussein Y. Afeefy, Joel F. Liebman, and Stephen E. Stein
Quantity | Value | Units | Method | Reference | Comment |
---|---|---|---|---|---|
ΔcH°solid | -11560. | kJ/mol | Ccb | Serijan and Wise, 1951 | Corresponding ΔfHºsolid = -380. kJ/mol (simple calculation by NIST; no Washburn corrections) |

Phase change data

Data compiled by: Thermodynamics Research Center, NIST Boulder Laboratories, Chris Muzny director
Quantity | Value | Units | Method | Reference | Comment |
---|---|---|---|---|---|
Tboil | 589. | K | N/A | Serijan and Wise, 1951, 2 | Uncertainty assigned by TRC = 3. K |
Quantity | Value | Units | Method | Reference | Comment |
Tfus | 276.54 | K | N/A | Serijan and Wise, 1951, 2 | Crystal phase 2 phase; Uncertainty assigned by TRC = 0.2 K |
Tfus | 281.9 | K | N/A | Serijan and Wise, 1951, 2 | Crystal phase 1 phase; Uncertainty assigned by TRC = 0.8 K |

References

Serijan and Wise, 1951
Serijan, K.T.; Wise, P.H.,
Dicyclic hydrocarbons. IV. Synthesis and physical properties of α,α- and α,omega-diphenyl- and dicyclohexyl- pentanes and hexanes,
J. Am. Chem. Soc., 1951, 73, 5191-5193. [all data]
Serijan and Wise, 1951, 2
Serijan, K.T.; Wise, P.H.,
Dicyclic hydrocarboms. IV. Synthesis and Physical properties of alpha,alpha - and alpha,omega-diphenyl- and dicyclohexyl- pentanes and hexanes,
J. Am. Chem. Soc., 1951, 73, 5191. [all data]