Cyclohexene, 1-methyl-4-(1-methylethyl)-
- Formula: C10H18
- Molecular weight: 138.2499
- IUPAC Standard InChIKey: FAMJUFMHYAFYNU-UHFFFAOYSA-N
- CAS Registry Number: 5502-88-5
- Chemical structure:
View 3d structure (requires JavaScript / HTML 5) - Species with the same structure:
- Other names: p-Menth-1-ene; Carvomenthene; 1-p-Menthene; 1-Methyl-4-isopropylcyclohexene; δ1-p-Menthene; 1-Methyl-4-isopropyl-1-cyclohexene; 4-Isopropyl-1-methylcyclohexene; 1-Methyl-4-(1-methylethyl)cyclohexene; 4-Isopropyl-1-methyl-1-cyclohexene; p-1-Menthene; p-Ment-1-ene; NSC 96749; 1-Menthene

Gas phase thermochemistry data

Data compiled by: Hussein Y. Afeefy, Joel F. Liebman, and Stephen E. Stein
Quantity | Value | Units | Method | Reference | Comment |
---|---|---|---|---|---|
ΔfH°gas | -110.8 ± 3.2 | kJ/mol | Ccb | Kalechits, Luk'yanova, et al., 1990 |

Condensed phase thermochemistry data

Data compiled by: Hussein Y. Afeefy, Joel F. Liebman, and Stephen E. Stein
Quantity | Value | Units | Method | Reference | Comment |
---|---|---|---|---|---|
ΔfH°liquid | -159.8 ± 3.2 | kJ/mol | Ccb | Kalechits, Luk'yanova, et al., 1990 | |
Quantity | Value | Units | Method | Reference | Comment |
ΔcH°liquid | -6347.8 ± 3.1 | kJ/mol | Ccb | Kalechits, Luk'yanova, et al., 1990 | Corresponding ΔfHºliquid = -159.8 kJ/mol (simple calculation by NIST; no Washburn corrections) |

Phase change data

Data compiled as indicated in comments:
TRC - Thermodynamics Research Center, NIST Boulder Laboratories, Chris Muzny director
ALS - Hussein Y. Afeefy, Joel F. Liebman, and Stephen E. Stein
DRB - Donald R. Burgess, Jr.
Quantity | Value | Units | Method | Reference | Comment |
---|---|---|---|---|---|
Tboil | 443. | K | N/A | Pines, Olberg, et al., 1952 | Uncertainty assigned by TRC = 4. K; TRC |
Tboil | 450. | K | N/A | Smith, Fuzek, et al., 1949 | Uncertainty assigned by TRC = 1. K; TRC |
Tboil | 443. | K | N/A | Knoevenagel, 1897 | Uncertainty assigned by TRC = 5. K; position of side chains on ring not determined; TRC |
Quantity | Value | Units | Method | Reference | Comment |
ΔvapH° | 49.04 ± 0.33 | kJ/mol | C | Kalechits, Luk'yanova, et al., 1990 | ALS |
ΔvapH° | 49.0 | kJ/mol | N/A | Kalechits, Luk'yanova, et al., 1990 | DRB |

Kovats' RI, non-polar column, isothermal

Data compiled by: NIST Mass Spectrometry Data Center, William E. Wallace, director

Column type CapillaryCapillaryCapillaryCapillaryCapillary
Active phase SE-30SE-30SE-30SqualaneApiezon L
Column length (m) 100.100.64.100.45.
Carrier gas   HeHe
Substrate
Column diameter (mm) 0.50.50.250.250.25
Phase thickness (μm)
Temperature (C) 130.80.80.80.100.
I 1036.1019.1005.71019.91049.
ReferenceBredael, 1982Bredael, 1982Albaigés and Guardino, 1980Albaigés and Guardino, 1980Morishita, Okano, et al., 1980
Comment MSDC-RI MSDC-RI MSDC-RI MSDC-RI MSDC-RI
Column type Packed
Active phase SE-30
Column length (m) 6.145
Carrier gas N2
Substrate Chromosorb W
Column diameter (mm)
Phase thickness (μm)
Temperature (C) 160.
I 985.
ReferenceHedin, Thompson, et al., 1972
Comment MSDC-RI

Kovats' RI, non-polar column, temperature ramp

Data compiled by: NIST Mass Spectrometry Data Center, William E. Wallace, director

Column type CapillaryCapillaryCapillaryCapillaryCapillary
Active phase DB-5CP Sil 5 CBDB-1HP-5Methyl Silicone
Column length (m) 60.25.25.30.12.
Carrier gas HeHeHeHe
Substrate
Column diameter (mm) 0.320.250.20.320.5
Phase thickness (μm) 1.  0.25
Tstart (C) 40.50.60.70.70.
Tend (C) 230.230.220.250.250.
Heat rate (K/min) 3.3.3.3.4.
Initial hold (min) 5.
Final hold (min) 2.   15.
I 1032.1017.1020.1026.1017.7
ReferenceBuchin, Salmon, et al., 2002Kasali, Adio, et al., 2002Mevy, Bessiere, et al., 2002Ramos, Siani, et al., 2000Rao, Rajanikanth, et al., 1989
Comment MSDC-RI MSDC-RI MSDC-RI MSDC-RI MSDC-RI

Van Den Dool and Kratz RI, non-polar column, temperature ramp

Data compiled by: NIST Mass Spectrometry Data Center, William E. Wallace, director

Column type Capillary
Active phase SE-54
Column length (m) 30.
Carrier gas He
Substrate
Column diameter (mm) 0.25
Phase thickness (μm) 0.25
Tstart (C) 60.
Tend (C) 260.
Heat rate (K/min) 2.
Initial hold (min) 5.
Final hold (min)
I 1021.
ReferenceAlma, Nitz, et al., 2004
Comment MSDC-RI

References

Kalechits, Luk'yanova, et al., 1990
Kalechits, G.V.; Luk'yanova, V.A.; Kozina, M.P.; Gal'chenko, G.L.,
Synthesis and thermochemical parameters of 1-p-menthene and 3-p-menthene,
J. Gen. Chem. USSR, 1990, 60, 169-172. [all data]
Pines, Olberg, et al., 1952
Pines, H.; Olberg, R.C.; Ipatieff, V.N.,
J. Am. Chem. Soc., 1952, 74, 4872. [all data]
Smith, Fuzek, et al., 1949
Smith, H.A.; Fuzek, J.F.; Meriwether, H.T.,
The Catalytic Hydrogenation of Terpenes,
J. Am. Chem. Soc., 1949, 71, 3765. [all data]
Knoevenagel, 1897
Knoevenagel, E.,
Justus Liebigs Ann. Chem., 1897, 297, 113. [all data]