Cinnamic acid, (E)-, TMS derivative
- Formula: C12H16O2Si
- Molecular weight: 220.3397
- IUPAC Standard InChIKey: HEVXLPBSUCJVAQ-MDZDMXLPSA-N
- CAS Registry Number: 55012-82-3
- Chemical structure:
View 3d structure (requires JavaScript / HTML 5) - Stereoisomers:
- Other names: 2-Propenoic acid, 3-phenyl-, trimethylsilyl ester, (E)-; Trimethylsilyl (2E)-3-phenyl-2-propenoate; (E)-Cinnamic acid, TMS; trans-Cinnamic acid, TMS; trans-Cinnamic acid, trimethylsilyl ester

Van Den Dool and Kratz RI, non-polar column, temperature ramp

Column type | Active phase | I | Reference | Comment |
---|---|---|---|---|
Capillary | OV-1 | 1514. | Lefevere, Verhaeghe, et al., 1989 | 10. m/0.22 mm/0.17 μm, He, 5. K/min; Tstart: 70. C; Tend: 270. C |
Packed | OV-1 | 1521. | Tanaka, Hine, et al., 1980 | N2, 100-120 mesh, 70. C @ 0.5 min, 28. K/min; Column length: 1.8 m; Tend: 290. C |

Van Den Dool and Kratz RI, non-polar column, custom temperature program

Column type | Active phase | I | Reference | Comment |
---|---|---|---|---|
Capillary | VF-5MS | 1555.4 | Tret'yakov, 2008 | 30. m/0.25 mm/0.25 μm, He; Program: Multi-step temperature program; T(initial)=60C; T(final)=270C |
Packed | OV-101 | 1521. | Tanaka and Hine, 1982 | Program: not specified |

Normal alkane RI, non-polar column, temperature ramp

Column type | Active phase | I | Reference | Comment |
---|---|---|---|---|
Capillary | HP-5MS | 1547. | Lee, Yanamandra, et al., 2002 | 30. m/0.25 mm/0.25 μm, He, 70. C @ 3. min, 4. K/min, 280. C @ 3. min |

References

Lefevere, Verhaeghe, et al., 1989
Lefevere, M.F.; Verhaeghe, B.J.; Declerck, D.H.; Van Bocxlaer, J.F.; De Leenheer, A.P.; De Sagher, R.M.,
Metabolic Profiling of Urinary Organic Acids by Single and Multicolumn Capillary Gas Chromatography,
J. Chromatogr. Sci., 1989, 27, 1, 23-29, https://doi.org/10.1093/chromsci/27.1.23
. [all data]
Tanaka, Hine, et al., 1980
Tanaka, K.; Hine, D.G.; West-Dull, A.; Lynn, T.B.,
Gas-chromatographic method of analysis for urinary organic acids. I. Retention indices of 155 metabolically important compounds,
Clin. Chem., 1980, 26, 13, 1839-1846. [all data]
Tret'yakov, 2008
Tret'yakov, K.V.,
Retention Data. NIST Mass Spectrometry Data Center., NIST Mass Spectrometry Data Center, 2008. [all data]
Tanaka and Hine, 1982
Tanaka, K.; Hine, D.G.,
Compilation of Gas Chromatographic Retention Indices of 163 Metabolically Important Organic Acids, and Their Use in Detection of Patients with Organic Acidurias,
J. Chromatogr., 1982, 239, 301-322, https://doi.org/10.1016/S0021-9673(00)81990-1
. [all data]
Lee, Yanamandra, et al., 2002
Lee, B.Y.; Yanamandra, K.; Thurmon, T.F.,
Quantitative estimation of organic analytes with a capillary column,
Am. Clin. Lab., 2002, May, 30-34. [all data]