Naphthalene, 2-butyl-3-hexyl-
- Formula: C20H28
- Molecular weight: 268.4363
- IUPAC Standard InChIKey: KIOGLHSMEPYIQR-UHFFFAOYSA-N
- CAS Registry Number: 55000-56-1
- Chemical structure:
View 3d structure (requires JavaScript / HTML 5) - Other names: 2-n-Butyl-3-n-hexylnaphthalene; 2-Butyl-3-hexylnaphthalene

Phase change data

Data compiled as indicated in comments:
AC - William E. Acree, Jr., James S. Chickos
Enthalpy of vaporization
ΔvapH (kJ/mol) | Temperature (K) | Reference | Comment |
---|---|---|---|
80.8 | 437. | Dixon, Yarnell, et al., 1963 | Based on data from 422. to 485. K. See also Boublik, Fried, et al., 1984 and Dykyj, Svoboda, et al., 1999.; AC |
Antoine Equation Parameters
log10(P) = A − (B / (T + C))
P = vapor pressure (bar)
T = temperature (K)
View plot Requires a JavaScript / HTML 5 canvas capable browser.
Temperature (K) | A | B | C | Reference | Comment |
---|---|---|---|---|---|
421.7 to 485. | 5.97676 | 3508.222 | -38.3 | Dixon, Yarnell, et al., 1963 | Coefficents calculated by NIST from author's data. |

References

Dixon, Yarnell, et al., 1963
Dixon, Joseph A.; Yarnell, G.R.; Mountain, J.A.,
Physical Properties of Twelve Isomeric Alkyl-Substituted Naphthalenes, Tetrahydronaphthalenes, and Decahydronaphthalenes.,
J. Chem. Eng. Data, 1963, 8, 4, 572-573, https://doi.org/10.1021/je60019a030
. [all data]
Boublik, Fried, et al., 1984
Boublik, T.; Fried, V.; Hala, E.,
The Vapour Pressures of Pure Substances: Selected Values of the Temperature Dependence of the Vapour Pressures of Some Pure Substances in the Normal and Low Pressure Region, 2nd ed., Elsevier, New York, 1984, 972. [all data]
Dykyj, Svoboda, et al., 1999
Dykyj, J.; Svoboda, J.; Wilhoit, R.C.; Frenkel, M.L.; Hall, K.R.,
Vapor Pressure of Chemicals: Part A. Vapor Pressure and Antoine Constants for Hydrocarbons and Sulfur, Selenium, Tellurium and Hydrogen Containing Organic Compounds, Springer, Berlin, 1999, 373. [all data]