Benzo[c]phenanthrene, 5,8-dimethyl-
- Formula: C20H16
- Molecular weight: 256.3410
- IUPAC Standard InChIKey: PKNNRYLZAYRCOT-UHFFFAOYSA-N
- CAS Registry Number: 54986-63-9
- Chemical structure:
View 3d structure (requires JavaScript / HTML 5) - Other names: 5,8-dimethylbenzo[c]phenanthrene

Condensed phase thermochemistry data

Data compiled by: Hussein Y. Afeefy, Joel F. Liebman, and Stephen E. Stein
Quantity | Value | Units | Method | Reference | Comment |
---|---|---|---|---|---|
ΔfH°solid | 108.2 ± 5.4 | kJ/mol | Ccb | Frisch, Barker, et al., 1963 | see Karnes, Kybett, et al., 1965 and Frisch, 1962 |
Quantity | Value | Units | Method | Reference | Comment |
ΔcH°solid | -10265.1 ± 5.4 | kJ/mol | Ccb | Frisch, Barker, et al., 1963 | see Karnes, Kybett, et al., 1965 and Frisch, 1962; Corresponding ΔfHºsolid = 108.2 kJ/mol (simple calculation by NIST; no Washburn corrections) |

Van Den Dool and Kratz RI, non-polar column, custom temperature program

Column type | Active phase | I | Reference | Comment |
---|---|---|---|---|
Capillary | Methyl Silicone | 2652. | Oda, Ichikawa, et al., 1996 | Program: 50C (2min) => 20C/min => 160C => 5C/min => 210C => 10C/min => 300C |

References

Frisch, Barker, et al., 1963
Frisch, M.A.; Barker, C.; Margrave, J.L.; Newman, M.S.,
Strain energies in hydrocarbons from heats to combustion. I. 4,5-and 2,7-dimethylphenanthrenes, 1,12- and 5,8-benzo(c)phenanthrenes and 1',9- and 3',6-benzanthracenes,
J. Am. Chem. Soc., 1963, 85, 2356-2357. [all data]
Karnes, Kybett, et al., 1965
Karnes, H.A.; Kybett, B.D.; Wilson, M.H.; Margrave, J.L.; Newman, M.S.,
Strain energies in hydrocarbons from heats of combustion. III. 3,4,5,6- and 2,4,5,7-tetramethylphenanthrenes,
J. Am. Chem. Soc., 1965, 87, 5554-5558. [all data]
Frisch, 1962
Frisch, M.A.,
A high precision calorimeter for ther measurement of small energy differences, Ph.D. Thesis for University of Wisconsin, 1962, 1-100. [all data]
Oda, Ichikawa, et al., 1996
Oda, J.; Ichikawa, S.; Mori, T.,
Analysis of polycyclic aromatic hydrocarbons in airborne particulates by capillary GC/MS method with programmed temperature relative retention index,
Bunseki Kagaku, 1996, 45, 9, 825-835, https://doi.org/10.2116/bunsekikagaku.45.825
. [all data]