Chrysene, 5-ethyl-
- Formula: C20H16
- Molecular weight: 256.3410
- IUPAC Standard InChIKey: ORJZWFYYEFBNFP-UHFFFAOYSA-N
- CAS Registry Number: 54986-62-8
- Chemical structure:
View 3d structure (requires JavaScript / HTML 5) - Permanent link for this species. Use this link for bookmarking this species for future reference.

Phase change data

Data compiled by: Thermodynamics Research Center, NIST Boulder Laboratories, Chris Muzny director
Quantity | Value | Units | Method | Reference | Comment |
---|---|---|---|---|---|
Tfus | 362. | K | N/A | Newman, 1940 | Uncertainty assigned by TRC = 4. K |

References

Newman, 1940
Newman, M.S.,
The Synthesis of 5-Methylchyrsene and Related Compounds,
J. Am. Chem. Soc., 1940, 62, 870. [all data]