Naphthalene, decahydro-2,6-dimethyl-3-octyl-
- Formula: C20H38
- Molecular weight: 278.5157
- IUPAC Standard InChIKey: WYHUFBHZXGAZJH-UHFFFAOYSA-N
- CAS Registry Number: 54964-85-1
- Chemical structure:
View 3d structure (requires JavaScript / HTML 5) - Other names: 2,6-Dimethyl-3-n-octyldecahydronaphthalene; 3,8-Dimethyl-4-n-octylbicyclo(4.4.0)decane; Decahydro-2,6-dimethyl-3-octylnaphthalene; 2,6-Dimethyl-3-octyldecahydronaphthalene

Phase change data

Data compiled as indicated in comments:
AC - William E. Acree, Jr., James S. Chickos
Enthalpy of vaporization
ΔvapH (kJ/mol) | Temperature (K) | Reference | Comment |
---|---|---|---|
76.4 | 421. | Dixon, Yarnell, et al., 1963 | Based on data from 406. to 469. K. See also Boublik, Fried, et al., 1984.; AC |
Antoine Equation Parameters
log10(P) = A − (B / (T + C))
P = vapor pressure (bar)
T = temperature (K)
View plot Requires a JavaScript / HTML 5 canvas capable browser.
Temperature (K) | A | B | C | Reference | Comment |
---|---|---|---|---|---|
406. to 469.0 | 6.41229 | 3830.326 | -6.728 | Dixon, Yarnell, et al., 1963 | Coefficents calculated by NIST from author's data. |

References

Dixon, Yarnell, et al., 1963
Dixon, Joseph A.; Yarnell, G.R.; Mountain, J.A.,
Physical Properties of Twelve Isomeric Alkyl-Substituted Naphthalenes, Tetrahydronaphthalenes, and Decahydronaphthalenes.,
J. Chem. Eng. Data, 1963, 8, 4, 572-573, https://doi.org/10.1021/je60019a030
. [all data]
Boublik, Fried, et al., 1984
Boublik, T.; Fried, V.; Hala, E.,
The Vapour Pressures of Pure Substances: Selected Values of the Temperature Dependence of the Vapour Pressures of Some Pure Substances in the Normal and Low Pressure Region, 2nd ed., Elsevier, New York, 1984, 972. [all data]