Cyclohexane, 1,1'-propylidenebis-
- Formula: C15H28
- Molecular weight: 208.3828
- IUPAC Standard InChIKey: ROFWOEQFASWFTK-UHFFFAOYSA-N
- CAS Registry Number: 54934-91-7
- Chemical structure:
View 3d structure (requires JavaScript / HTML 5) - Other names: 1,1-Dicyclohexylpropane

Condensed phase thermochemistry data

Data compiled by: Hussein Y. Afeefy, Joel F. Liebman, and Stephen E. Stein
Quantity | Value | Units | Method | Reference | Comment |
---|---|---|---|---|---|
ΔcH°solid | -2140. | kcal/mol | Ccb | Serijan and Wise, 1951 | Corresponding ΔfHºsolid = -227. kcal/mol (simple calculation by NIST; no Washburn corrections) |

References

Serijan and Wise, 1951
Serijan, K.T.; Wise, P.H.,
Dicyclic hydrocarbons. III. Diphenyl- and dicyclohexylalkanes through C15,
J. Am. Chem. Soc., 1951, 73, 4766-4769. [all data]