Cyclohexane, 1,1'-(1-methylethylidene)bis-
- Formula: C15H28
- Molecular weight: 208.3828
- IUPAC Standard InChIKey: CCXLOQVMDTWRSP-UHFFFAOYSA-N
- CAS Registry Number: 54934-90-6
- Chemical structure:
View 3d structure (requires JavaScript / HTML 5) - Other names: 2,2-Dicyclohexylpropane

Condensed phase thermochemistry data

Data compiled by: Hussein Y. Afeefy, Joel F. Liebman, and Stephen E. Stein
Quantity | Value | Units | Method | Reference | Comment |
---|---|---|---|---|---|
ΔcH°liquid | -8996. | kJ/mol | Ccb | Serijan and Wise, 1951 | Corresponding ΔfHºliquid = -908. kJ/mol (simple calculation by NIST; no Washburn corrections) |

Phase change data

Data compiled by: Thermodynamics Research Center, NIST Boulder Laboratories, Chris Muzny director

Quantity Value Units Method Reference Comment
Tboil559.4KN/ASerijan and Wise, 1951Uncertainty assigned by TRC = 0.5 K
Tboil559.4KN/ASerijan and Wise, 1951, 2Uncertainty assigned by TRC = 0.6 K
Quantity Value Units Method Reference Comment
Tfus288.76KN/ASerijan and Wise, 1951Uncertainty assigned by TRC = 1. K
Tfus288.76KN/ASerijan and Wise, 1951, 2Uncertainty assigned by TRC = 0.3 K

In addition to the Thermodynamics Research Center (TRC) data available from this site, much more physical and chemical property data is available from the following TRC products:

References

Serijan and Wise, 1951
Serijan, K.T.; Wise, P.H.,
Dicyclic hydrocarbons. III. Diphenyl- and dicyclohexylalkanes through C15,
J. Am. Chem. Soc., 1951, 73, 4766-4769. [all data]