Phenol, 2,5-bis(1-methylpropyl)-
- Formula: C14H22O
- Molecular weight: 206.3239
- IUPAC Standard InChIKey: USKPGPJXOGQXMS-UHFFFAOYSA-N
- CAS Registry Number: 54932-77-3
- Chemical structure:

Reaction thermochemistry data

Data compiled by: Hussein Y. Afeefy, Joel F. Liebman, and Stephen E. Stein
Individual Reactions
By formula: C6H6O + C14H22O = C10H14O + C10H14O
Quantity | Value | Units | Method | Reference | Comment |
---|---|---|---|---|---|
ΔrH° | -2.6 ± 1.1 | kJ/mol | Eqk | Nesterova, Pimerzin, et al., 1989 | liquid phase; Isomerization |

References

Nesterova, Pimerzin, et al., 1989
Nesterova, T.N.; Pimerzin, A.A.; Rozhnov, A.M.; Karlina, T.N.,
Equilibria for the isomerization of (secondary-alkyl)phenols and cyclohexylphenols,
J. Chem. Thermodyn., 1989, 21, 385-395. [all data]