6-Benzylquinoline
- Formula: C16H13N
- Molecular weight: 219.2811
- IUPAC Standard InChIKey: GMGJJCVVIGBOAJ-UHFFFAOYSA-N
- CAS Registry Number: 54884-99-0
- Chemical structure:
View 3d structure (requires JavaScript / HTML 5) - Other names: Quinoline, 6-(phenylmethyl)-

Phase change data

Data compiled by: Robert L. Brown and Stephen E. Stein
Quantity | Value | Units | Method | Reference | Comment |
---|---|---|---|---|---|
Tfus | 352. to 353. | K | N/A | Buckingham and Donaghy, 1982 |
Reduced pressure boiling point
Tboil (K) | Pressure (bar) | Reference |
---|---|---|
413.7 | 0.001 | Weast and Grasselli, 1989 |
412. to 415. | 0.001 | Buckingham and Donaghy, 1982 |

References

Buckingham and Donaghy, 1982
Buckingham, J.; Donaghy, S.M.,
Dictionary of Organic Compounds: Fifth Edition, Chapman and Hall, New York, 1982, 1. [all data]
Weast and Grasselli, 1989
CRC Handbook of Data on Organic Compounds, 2nd Editon, Weast,R.C and Grasselli, J.G., ed(s)., CRC Press, Inc., Boca Raton, FL, 1989, 1. [all data]