Cyclohexane, 1,1'-(1,5-pentanediyl)bis-
- Formula: C17H32
- Molecular weight: 236.4360
- IUPAC Standard InChIKey: ALPSDJDPJHLYKS-UHFFFAOYSA-N
- CAS Registry Number: 54833-31-7
- Chemical structure:
View 3d structure (requires JavaScript / HTML 5) - Permanent link for this species. Use this link for bookmarking this species for future reference.

Condensed phase thermochemistry data

Data compiled by: Hussein Y. Afeefy, Joel F. Liebman, and Stephen E. Stein
Quantity | Value | Units | Method | Reference | Comment |
---|---|---|---|---|---|
ΔcH°liquid | -10930. | kJ/mol | Ccb | Serijan and Wise, 1951 | Corresponding ΔfHºliquid = -330. kJ/mol (simple calculation by NIST; no Washburn corrections) |

Phase change data

Data compiled by: Thermodynamics Research Center, NIST Boulder Laboratories, Chris Muzny director
Quantity | Value | Units | Method | Reference | Comment |
---|---|---|---|---|---|
Tboil | 598.30 | K | N/A | Serijan and Wise, 1951, 2 | Uncertainty assigned by TRC = 0.3 K |
Tboil | 588. | K | N/A | Ipatieff and Orlov, 1927 | Uncertainty assigned by TRC = 8. K |
Tboil | 584. | K | N/A | Sabatier and Murat, 1915 | Uncertainty assigned by TRC = 5. K |
Tboil | 584. | K | N/A | Sabatier and Murat, 1913 | Uncertainty assigned by TRC = 5. K |
Quantity | Value | Units | Method | Reference | Comment |
Tfus | 259.54 | K | N/A | Serijan and Wise, 1951, 3 | Uncertainty assigned by TRC = 1. K |
Tfus | 259.54 | K | N/A | Serijan and Wise, 1951, 2 | Uncertainty assigned by TRC = 0.2 K |

References

Serijan and Wise, 1951
Serijan, K.T.; Wise, P.H.,
Dicyclic hydrocarbons. IV. Synthesis and physical properties of α,α- and α,omega-diphenyl- and dicyclohexyl- pentanes and hexanes,
J. Am. Chem. Soc., 1951, 73, 5191-5193. [all data]
Serijan and Wise, 1951, 2
Serijan, K.T.; Wise, P.H.,
Dicyclic hydrocarboms. IV. Synthesis and Physical properties of alpha,alpha - and alpha,omega-diphenyl- and dicyclohexyl- pentanes and hexanes,
J. Am. Chem. Soc., 1951, 73, 5191. [all data]
Ipatieff and Orlov, 1927
Ipatieff, V.N.; Orlov, N.,
C. R. Hebd. Seances Acad. Sci., 1927, 184, 751. [all data]
Sabatier and Murat, 1915
Sabatier, P.; Murat, M.,
Ann. Chim. (Paris), 1915, 4, 253. [all data]
Sabatier and Murat, 1913
Sabatier, P.; Murat, M.,
C. R. Hebd. Seances Acad. Sci., 1913, 156, 1430. [all data]
Serijan and Wise, 1951, 3
Serijan, K.T.; Wise, P.H.,
, Natl. Advis. Comm. Aeronaut., Lewis Flight Propulsion Lab ., Cleveland, 1951. [all data]