1,1-Dicyclohexylpentane
- Formula: C17H32
- Molecular weight: 236.4360
- IUPAC Standard InChIKey: VSDFUDGIBYCRIM-UHFFFAOYSA-N
- CAS Registry Number: 54833-30-6
- Chemical structure:
View 3d structure (requires JavaScript / HTML 5) - Other names: Cyclohexane, 1,1'-pentylidenebis-

Condensed phase thermochemistry data

Data compiled by: Hussein Y. Afeefy, Joel F. Liebman, and Stephen E. Stein
Quantity | Value | Units | Method | Reference | Comment |
---|---|---|---|---|---|
ΔcH°liquid | -10930. | kJ/mol | Ccb | Serijan and Wise, 1951 | Corresponding ΔfHºliquid = -330. kJ/mol (simple calculation by NIST; no Washburn corrections) |

Phase change data

Data compiled by: Thermodynamics Research Center, NIST Boulder Laboratories, Chris Muzny director
Quantity | Value | Units | Method | Reference | Comment |
---|---|---|---|---|---|
Tboil | 581. | K | N/A | Serijan and Wise, 1951, 2 | Uncertainty assigned by TRC = 3. K |
Quantity | Value | Units | Method | Reference | Comment |
Tfus | 288.44 | K | N/A | Serijan and Wise, 1951, 2 | Uncertainty assigned by TRC = 0.2 K |

References

Serijan and Wise, 1951
Serijan, K.T.; Wise, P.H.,
Dicyclic hydrocarbons. IV. Synthesis and physical properties of α,α- and α,omega-diphenyl- and dicyclohexyl- pentanes and hexanes,
J. Am. Chem. Soc., 1951, 73, 5191-5193. [all data]
Serijan and Wise, 1951, 2
Serijan, K.T.; Wise, P.H.,
Dicyclic hydrocarboms. IV. Synthesis and Physical properties of alpha,alpha - and alpha,omega-diphenyl- and dicyclohexyl- pentanes and hexanes,
J. Am. Chem. Soc., 1951, 73, 5191. [all data]