Eicosane, 10-methyl-
- Formula: C21H44
- Molecular weight: 296.5741
- IUPAC Standard InChIKey: BFAGLVWBOUDHBS-UHFFFAOYSA-N
- CAS Registry Number: 54833-23-7
- Chemical structure:

Phase change data

Data compiled by: Thermodynamics Research Center, NIST Boulder Laboratories, Chris Muzny director
Quantity | Value | Units | Method | Reference | Comment |
---|---|---|---|---|---|
Tfus | 269.35 | K | N/A | Anonymous, 1968 | |
Tfus | 269.4 | K | N/A | Anonymous, 1955 | Uncertainty assigned by TRC = 0.5 K |

Kovats' RI, polar column, isothermal

Data compiled by: NIST Mass Spectrometry Data Center, William E. Wallace, director

Column type Capillary
Active phase Carbowax 20M
Column length (m) 15.24
Carrier gas N2
Substrate
Column diameter (mm) 0.5
Phase thickness (μm)
Temperature (C) 125.
I 2110.
ReferenceHedin, Thopson, et al., 1972
Comment MSDC-RI

References

Anonymous, 1968
Anonymous, R.,
Properties of hydrocarbon of high molecular weight, Am. Pet. Inst. Res. Proj. 42, Penn. State Univ., 1968. [all data]
Anonymous, 1955
Anonymous, R.,
, Am. Pet. Inst. Res. Proj. 45, Tech. Rep. 14, No. 1, Ohio State Univ., 1955. [all data]