Triacetamide nitrate

Condensed phase thermochemistry data

Data compiled by: Eugene S. Domalski and Elizabeth D. Hearing

Quantity Value Units Method Reference Comment
solid,1 bar443.8J/mol*KN/ANurachmetov, Beremzhanov, et al., 1985
solid,1 bar443.8J/mol*KN/ANurachmetov, Beremzhanov, et al., 1985

Constant pressure heat capacity of solid

Cp,solid (J/mol*K) Temperature (K) Reference Comment
383.0298.15Nurachmetov, Beremzhanov, et al., 1985T = 60 to 330 K.
383.0298.15Nurachmetov, Beremzhanov, et al., 1985T = 60 to 330 K.

References

Nurachmetov, Beremzhanov, et al., 1985
Nurachmetov, N.N.; Beremzhanov, B.A.; Abramova, G.V.; Lebedev, B.V., Thermodynamics of (thio)amides and their compounds with mineral acids at (0-330)K, Thermochim. Acta, 1985, 92, 329-332. [all data]