Bicyclo[4.1.0]heptan-3-ol, 4,7,7-trimethyl-, (1α,3β,4α,6α)-

Gas phase thermochemistry data

Data compiled by: Hussein Y. Afeefy, Joel F. Liebman, and Stephen E. Stein

Quantity Value Units Method Reference Comment
Δfgas-234.1 ± 4.1kJ/molCcbLuk'yanova, Kozina, et al., 1984

References

Luk'yanova, Kozina, et al., 1984
Luk'yanova, V.A.; Kozina, M.P.; Gal'chenka, G.L.; Kalechits, G.V.; Bardyshev, I.I., Heats of combustion and formation of cis-caras-trans-2- and -4-ols, Vestsi Akad. Nauk. BSSR, Ser. Khim. Nauk., 1984, 78-82. [all data]