SiF3 anion
- Formula: F3Si-
- Molecular weight: 85.0813
- CAS Registry Number: 54711-93-2

Gas phase ion energetics data

Data compiled by: John E. Bartmess
Protonation reactions
By formula: F3Si- + H+ = HF3Si
Quantity | Value | Units | Method | Reference | Comment |
---|---|---|---|---|---|
ΔrH° | 1498. ± 22. | kJ/mol | D-EA | Kawamata, Neigishi, et al., 1996 | gas phase; Vertical Detachment Energy: 2.76±0.05 eV. |
Quantity | Value | Units | Method | Reference | Comment |
ΔrG° | 1466. ± 22. | kJ/mol | H-TS | Kawamata, Neigishi, et al., 1996 | gas phase; Vertical Detachment Energy: 2.76±0.05 eV. |

Vibrational and/or electronic energy levels

Data compiled by: Marilyn E. Jacox
State: X
Vib. sym. |
No. | Approximate type of mode |
cm-1 | Med. | Method | References | |
---|---|---|---|---|---|---|---|
a1 | 1 | SiF3 stretch | 770.3 | Ne | IR | Jacox, Irikura, et al., 1995 | |
2 | Umbrella | 401 | H | Ne | IR | Jacox, Irikura, et al., 1995 | |
e | 3 | SiF3 stretch | 757.0 | Ne | IR | Jacox, Irikura, et al., 1995 | |
3 | SiF3 stretch | 750.9 | Ne | IR | Jacox, Irikura, et al., 1995 | ||
Additional references: Jacox, 1998, page 263

References

Kawamata, Neigishi, et al., 1996
Kawamata, H.; Neigishi, Y.; Kishi, R.; Iwata, S.; Nakajima, A.; Kaya, K.,
Photoelectron Spectroscopy of Silicon-Fluorine Binary Cluster Anions (SinFm-),
J. Chem. Phys., 1996, 105, 13, 5369, https://doi.org/10.1063/1.472377
. [all data]