4-Aminophenyl methyl sufhone
- Formula: C7H9NO2S
- Molecular weight: 171.217
- IUPAC Standard InChIKey: XJEVFFNOMKXBLU-UHFFFAOYSA-N
- CAS Registry Number: 5470-49-5
- Chemical structure:
View 3d structure (requires JavaScript / HTML 5) - Other names: Benzenamine, 4-(methylsulfonyl)-; Aniline, p-(methylsulfonyl)-; 4-(Methylsulfonyl)aniline; 4-mesylaniline

Reaction thermochemistry data

Data compiled by: John E. Bartmess
Individual Reactions
C7H8NO2S- + =
By formula: C7H8NO2S- + H+ = C7H9NO2S
Quantity | Value | Units | Method | Reference | Comment |
---|---|---|---|---|---|
ΔrH° | 1455. ± 8.8 | kJ/mol | G+TS | Taft and Topsom, 1987 | gas phase; value altered from reference due to change in acidity scale |
Quantity | Value | Units | Method | Reference | Comment |
ΔrG° | 1424. ± 8.4 | kJ/mol | IMRE | Taft and Topsom, 1987 | gas phase; value altered from reference due to change in acidity scale |

Gas phase ion energetics data

Data compiled by: John E. Bartmess
De-protonation reactions
C7H8NO2S- + =
By formula: C7H8NO2S- + H+ = C7H9NO2S
Quantity | Value | Units | Method | Reference | Comment |
---|---|---|---|---|---|
ΔrH° | 1455. ± 8.8 | kJ/mol | G+TS | Taft and Topsom, 1987 | gas phase; value altered from reference due to change in acidity scale |
Quantity | Value | Units | Method | Reference | Comment |
ΔrG° | 1424. ± 8.4 | kJ/mol | IMRE | Taft and Topsom, 1987 | gas phase; value altered from reference due to change in acidity scale |

References

Taft and Topsom, 1987
Taft, R.W.; Topsom, R.D.,
The Nature and Analysis of Substituent Effects,
Prog. Phys. Org. Chem., 1987, 16, 1. [all data]