Thujone

Kovats' RI, non-polar column, custom temperature program

Data compiled by: NIST Mass Spectrometry Data Center, William E. Wallace, director

Column type CapillaryCapillaryCapillaryCapillaryCapillary
Active phase DB-5MSBP-1DB-5MSHP-5OV-1
Column length (m) 30.25.30.30.30.
Carrier gas HeN2HeHeHe
Substrate
Column diameter (mm) 0.250.250.320.250.25
Phase thickness (μm) 0.250.250.250.250.25
Program 60C(5min) => 2C/min => 140C= 5C/min => 250C(5min)60C => 5C/min => 220C(5min) => 3C/min => 245C(5min)40C (3min) => 5C/min => 160C (2min) => 10C/min => 280C (10min)40C (3min) => 3C/min => 180C => 30C/min => 270C (5min)44C(4min) => 3C/min => 74C => 6C/min => 134C => 12C/min => 312C
I 1106.1090.1117.1102.1081.
ReferenceTuberoso, Kowalczyk, et al., 2005Dwivedi, Khan, et al., 2004Radulescu, Chiliment, et al., 2004Daferera, Ziogas, et al., 2003El-Shazly, Dorai, et al., 2002
Comment MSDC-RI MSDC-RI MSDC-RI MSDC-RI MSDC-RI

Normal alkane RI, non-polar column, custom temperature program

Data compiled by: NIST Mass Spectrometry Data Center, William E. Wallace, director

Column type CapillaryCapillaryCapillaryCapillaryCapillary
Active phase DB-1RTX-1HP-5 MSHP-5 MSHP-5 MS
Column length (m) 30.60.30.30.30.
Carrier gas HydrogenHeliumHeliumHeliumHelium
Substrate
Column diameter (mm) 0.250.220.250.250.25
Phase thickness (μm) 0.250.250.250.250.25
Program 45 0C 3 0C/min -> 175 0C 15 0C/min -> 300 0C (10 min)not specified40 0C (10 min) 3 0C/min -> 200 0C 2 0C/min -> 220 0C60 0C (1 min) 10 0C/min -> 180 0C (1 min) 20 0C/min -> 280 0C (15 min)40 0C (5 min) 2 0C/min -> 270 0C -> 260 0C (20 min)
I 1074.1086.1105.1114.1105.
ReferenceAlbano, Lima, et al., 2012Bendiabdellah, El Amine Dib, et al., 2012Sharopov, Sulaimonova, et al., 2012Liu, Chu, et al., 2010Mancini, Arnold, et al., 2009
Comment MSDC-RI MSDC-RI MSDC-RI MSDC-RI MSDC-RI
Column type CapillaryCapillaryCapillaryCapillaryCapillary
Active phase HP-5SLB-5 MSSLB-5 MSBP-5DB-5 MS
Column length (m) 30.30.30.30.30.
Carrier gas  HeliumHeliumHeHelium
Substrate
Column diameter (mm) 0.320.250.250.320.25
Phase thickness (μm)  0.250.250.250.25
Program not specified50 0C 3 0C/min -> 250 0C (1 min) 10 0C/min -> 300 0C (5 min)not specified60C => 4C/min => 150C => 10C/min => 220C60 0C 3 0C/min -> 210 0C 5 0C/min -> 250 0C
I 1114.1107.1101.1105.1102.
ReferenceRiahi, Pourbasheer, et al., 2009Costa, De Fina, et al., 2008Costa, De Fina, et al., 2008Hashemi, Abolghasemi, et al., 2007Haznagy-Radnai, Szigle, et al., 2007
Comment MSDC-RI MSDC-RI MSDC-RI MSDC-RI MSDC-RI
Column type CapillaryCapillaryCapillaryCapillaryCapillary
Active phase BPX-5HP-5MSCP Sil 8 CBHP-5MSSE-52
Column length (m) 30.30.50.30.30.
Carrier gas HeHeHeHeHe
Substrate
Column diameter (mm) 0.250.250.320.250.32
Phase thickness (μm) 0.250.250.250.250.15
Program 50C => 3C/min => 150C(10min) => 10C/min => 250C40C(5min) => 2C/min => 250C(15min) => 10C/min => 270C60C(2min) => 5C/min => 160C(1min) => 10C/min => 250C (5min)40C(5min) => 2C/min => 250C (15min) => 10C/min => 270C45C => 1C/min => 100C => 5C/min => 250C (10min)
I 1118.1105.1102.1105.1102.
ReferenceSalamci, Kordali, et al., 2007Formisano C., Senatore F., et al., 2006Judzentiene and Buzelyte, 2006Senatore, Apostolides Arnold, et al., 2006Tognolini, Barocelli, et al., 2006
Comment MSDC-RI MSDC-RI MSDC-RI MSDC-RI MSDC-RI
Column type CapillaryCapillaryCapillaryCapillaryCapillary
Active phase CP Sil 8 CBDB-5BPX-5CP Sil 8 CBHP-5
Column length (m) 50.30.30.50.30.
Carrier gas HeHe He
Substrate
Column diameter (mm) 0.320.250.250.320.25
Phase thickness (μm) 0.250.250.250.250.25
Program 50C(5min) => 2C/min => 90C => 15C/min => 240C(4min)40C(1min) => 9C/min => 130C => 2C/min => 230C60C(0.2min) => 3K/min => 186C => 10C/min => 240C (5min)60C(2min) => 5C/min => 160C(1min) => 10C/min => 250C (5min)40C(5min) => 2C/min => 250C(15min) => 10C/min => 270C
I 1102.1111.1102.1102.1105.
ReferenceButkienë, Nivinskienë, et al., 2005Hamm, Bleton, et al., 2005Judzentiene and Mockute, 2005Judpentienë and Mockutë, 2004Senatore, Apostolides Arnold, et al., 2004
Comment MSDC-RI MSDC-RI MSDC-RI MSDC-RI MSDC-RI
Column type CapillaryCapillaryCapillaryCapillaryCapillary
Active phase SE-30SE-30CP Sil 8 CBDB-1DB-5
Column length (m)   50.30.30.
Carrier gas   HeHeHe
Substrate
Column diameter (mm)   0.320.250.25
Phase thickness (μm)   0.250.250.25
Program not specifiednot specified60C(1min) => 5C/min => 160C => 10C/min => 250C(5min)45C => 3C/min => 175C => 15C/min => 240C (10min)60C => 3C/min => 240C => 30C/min => 300C
I 1107.1088.1102.1073.1117.
ReferenceVinogradov, 2004Vinogradov, 2004Mockute, Nivinskiene, et al., 2003Baratta, Dorman, et al., 1998Yusuf, Begum, et al., 1998
Comment MSDC-RI MSDC-RI MSDC-RI MSDC-RI MSDC-RI
Column type CapillaryCapillaryCapillaryCapillaryCapillary
Active phase CP Sil 5 CBPolydimethyl siloxanesDB-5Methyl SiliconeOV-101
Column length (m) 30. 30.
Carrier gas N2
Substrate
Column diameter (mm) 0.25 0.25
Phase thickness (μm)
Program not specifiednot specifiednot specifiednot specifiednot specified
I 1091.1094.1113.1086.1084.
ReferenceWeyerstahl, Marschall, et al., 1997Zenkevich, 1997Jean, Garneau, et al., 1993Grundschober, 1991De Pooter, Vermeesch, et al., 1989
Comment MSDC-RI MSDC-RI MSDC-RI MSDC-RI MSDC-RI
Column type Packed
Active phase OV-101
Column length (m) 2.5
Carrier gas N2
Substrate Chromosorb G 60-80mesh DMCS
Column diameter (mm)
Phase thickness (μm)
Program not specified
I 1100.
ReferenceSwigar and Silverstein, 1981
Comment MSDC-RI

Van Den Dool and Kratz RI, polar column, temperature ramp

Data compiled by: NIST Mass Spectrometry Data Center, William E. Wallace, director

Column type CapillaryCapillaryCapillaryCapillaryCapillary
Active phase HP-InnowaxBP-20DB-WaxHP-20MDB-Wax
Column length (m) 30.50.30.50.60.
Carrier gas HeHeHeHeN2
Substrate
Column diameter (mm) 0.250.220.320.20.25
Phase thickness (μm) 0.250.250.50.20.25
Tstart (C) 60.60.40.70.70.
Tend (C) 280.220.240.180.230.
Heat rate (K/min) 3.2.7.4.2.
Initial hold (min)    4.2.
Final hold (min)  20.5.10.20.
I 1435.1429.1438.1415.1431.
ReferenceKundakovic, Fokialakis, et al., 2007Lesueur, de Rocca Serra, et al., 2007Mahattanatawee K., Perez-Cacho P.R., et al., 2007Maksimovic, Vidic, et al., 2007Choi, 2005
Comment MSDC-RI MSDC-RI MSDC-RI MSDC-RI MSDC-RI
Column type CapillaryCapillaryCapillaryCapillaryCapillary
Active phase RTX-WaxBP-20HP-InnowaxHP-InnowaxDB-Wax
Column length (m) 60.50.30.30.60.
Carrier gas   HeHeN2
Substrate
Column diameter (mm) 0.220.220.250.250.25
Phase thickness (μm) 0.250.250.50.500.25
Tstart (C) 60.60.60.60.70.
Tend (C) 220.220.260.260.230.
Heat rate (K/min) 2.2.3.3.2.
Initial hold (min)     2.
Final hold (min) 20.20.  20.
I 1412.1399.1422.1422.1433.
ReferenceCozzani, Muselli, et al., 2005Gonny, Bradesi, et al., 2004Tzakou, Couladis, et al., 2003Couladis, Tzakou, et al., 2001Choi and Sawamura, 2000
Comment MSDC-RI MSDC-RI MSDC-RI MSDC-RI MSDC-RI
Column type CapillaryCapillary
Active phase Carbowax 20MCarbowax 20M
Column length (m) 25.60.
Carrier gas H2He
Substrate
Column diameter (mm) 0.250.32
Phase thickness (μm) 0.30.425
Tstart (C) 50.45.
Tend (C) 200.300.
Heat rate (K/min) 3.3.
Initial hold (min) 1.3.
Final hold (min) 20.20.
I 1420.1416.
ReferenceBicchi, Rubiolo, et al., 1998Mondello, Dugo, et al., 1995
Comment MSDC-RI MSDC-RI

Van Den Dool and Kratz RI, non-polar column, custom temperature program

Data compiled by: NIST Mass Spectrometry Data Center, William E. Wallace, director

Column type CapillaryCapillaryCapillaryCapillaryCapillary
Active phase HP-5MSBPX-5HP-5MS5 % Phenyl methyl siloxaneSE-52
Column length (m) 30.30.30.30.60.
Carrier gas He HeHeHe
Substrate
Column diameter (mm) 0.250.250.250.320.32
Phase thickness (μm) 0.250.250.250.150.40
Program 60C (1 min) => 5 C/min => 210C => 10 C/min => 280C (15 min)35C(5min) => 3C/min => 210C => 40C/min => 240C (4min)50C (3min) => 3C/min => 200C => 6C/min => 240C45C => 1C/min => 100C => 5C/min => 250C (10min)45 C (6 min) 3 C/min -> 111 0C 2 C/min -> 160 C 3 C/min -> 300 C (15 min)
I 1113.31121.1102.1102.1108.
ReferenceAndriamaharavo, 2014Cardeal, da Silva, et al., 2006Akpulat, Tepe, et al., 2005Sacchetti, Maietti, et al., 2005Mondello, Dugo, et al., 1995
Comment MSDC-RI MSDC-RI MSDC-RI MSDC-RI MSDC-RI

Kovats' RI, polar column, temperature ramp

Data compiled by: NIST Mass Spectrometry Data Center, William E. Wallace, director

Column type Capillary
Active phase Supelcowax-10
Column length (m) 30.
Carrier gas He
Substrate
Column diameter (mm) 0.32
Phase thickness (μm) 0.25
Tstart (C) 75.
Tend (C) 230.
Heat rate (K/min) 3.
Initial hold (min)
Final hold (min)
I 1421.
ReferenceTzakou and Couladis, 2001
Comment MSDC-RI

References

Tuberoso, Kowalczyk, et al., 2005
Tuberoso, C.I.G.; Kowalczyk, A.; Coroneo, V.; Russo, M.T.; Dessì, S.; Cabras, P., Chemical Composition and Antioxidant, Antimicrobial, and Antifungal Activities of the Essential Oil of Achillea ligustica All., J. Agric. Food Chem., 2005, 53, 26, 10148-10153, https://doi.org/10.1021/jf0518913 . [all data]

Dwivedi, Khan, et al., 2004
Dwivedi, S.; Khan, M.; Srivastava, S.K.; Syamasunnder, K.V.; Srivastava, A., Essential oil composition of different accessions of Mentha × piperita L. grown on the northern plains of India, Flavour Fragr. J., 2004, 19, 5, 437-440, https://doi.org/10.1002/ffj.1333 . [all data]

Radulescu, Chiliment, et al., 2004
Radulescu, V.; Chiliment, S.; Oprea, E., Capillary gas chromatography-mass spectrometry of volatile and semi-volatile compounds of Salvia officinalis, J. Chromatogr. A, 2004, 1027, 1-2, 121-126, https://doi.org/10.1016/j.chroma.2003.11.046 . [all data]

Daferera, Ziogas, et al., 2003
Daferera, D.J.; Ziogas, B.N.; Polissiou, M.G., The effectiveness of plant essential oils on the growth of Botrytis cinerea, Fusarium sp. and Clavibacter michiganensis subsp. michiganensis, Crop Prot., 2003, 22, 1, 39-44, retrieved from http://www.elsevier.com/gej-ng/10/25/40/84/25/31/article.pdf, https://doi.org/10.1016/S0261-2194(02)00095-9 . [all data]

El-Shazly, Dorai, et al., 2002
El-Shazly, A.; Dorai, G.; Wink, M., Composition and antimicrobial activity of essential oil and hexane-ether extract of Tanacetum santolinoides (DC.) Feinbr. and Fertig, Z. Naturforsch., 2002, 57c, 620-623. [all data]