pentane, 2,3-dimethyl-, (R)-
- Formula: C7H16
- Molecular weight: 100.2019
- IUPAC Standard InChIKey: WGECXQBGLLYSFP-ZETCQYMHSA-N
- CAS Registry Number: 54665-46-2
- Chemical structure:
View 3d structure (requires JavaScript / HTML 5) - Stereoisomers:

Phase change data

Data compiled by: Thermodynamics Research Center, NIST Boulder Laboratories, Chris Muzny director
Quantity | Value | Units | Method | Reference | Comment |
---|---|---|---|---|---|
Tboil | 361.15 | K | N/A | Lukes and Langthaler, 1957 | Uncertainty assigned by TRC = 2. K |

References

Lukes and Langthaler, 1957
Lukes, R.; Langthaler, J.,
Degradation of Branched Optically Active Tertiary Bases,
Chem. Listy, 1957, 51, 1869. [all data]