Octaphenylcyclotetrasiloxane
- Formula: C48H40O4Si4
- Molecular weight: 793.1708
- IUPAC Standard InChIKey: VSIKJPJINIDELZ-UHFFFAOYSA-N
- CAS Registry Number: 546-56-5
- Chemical structure:

Condensed phase thermochemistry data

Data compiled by: Eugene S. Domalski and Elizabeth D. Hearing
Quantity | Value | Units | Method | Reference | Comment |
---|---|---|---|---|---|
S°solid,1 bar | 249.5 | cal/mol*K | N/A | Kuliev, Dzhafarov, et al., 1982 |
Constant pressure heat capacity of solid
Cp,solid (cal/mol*K) | Temperature (K) | Reference | Comment |
---|---|---|---|
222.9 | 298.15 | Kuliev, Dzhafarov, et al., 1982 | T = 12 to 300 K. |

Phase change data

Data compiled by: William E. Acree, Jr., James S. Chickos
Enthalpy of fusion
ΔfusH (kcal/mol) | Temperature (K) | Method | Reference |
---|---|---|---|
0.301 | 473.2 | DSC | Matukhina, Shchegolikhina, et al., 2001 |
0.270 | 475. | N/A | Lebedev, Smirnova, et al., 2000 |
0.466 | 478.1 | N/A | Smith, 1979 |

Normal alkane RI, non-polar column, temperature ramp

View large format table.

Column type Active phase I Reference Comment
CapillaryMethyl Silicone4483.Fujimoto, Ohtani, et al., 199025. m/0.25 mm/0.1 μm, He, 5. K/min; Tstart: 40. C; Tend: 350. C

References

Kuliev, Dzhafarov, et al., 1982
Kuliev, A.M.; Dzhafarov, O.I.; Karasharli, K.A.; Kostryukov, V.N.,
Heat capacity and thermodynamic functions of 1,1,3,3,5,5-hexaphenyl-7,
7-dimethylcyclotetrasiloxane and octaphenylcyclotetrasiloxane, 1982, Azerb. [all data]
Matukhina, Shchegolikhina, et al., 2001
Matukhina, Elena V.; Shchegolikhina, Olga I.; Makarova, Natalia N.; Pozdniakova, Yulia A.; Katsoulis, Dimitris E.; Godovsky, Yuli K.,
New mesomorphic organocyclosiloxanes I. Thermal behaviour and mesophase structure of organocyclotetrasiloxanes,
Liquid Crystals, 2001, 28, 6, 869-879, https://doi.org/10.1080/02678290110039930
. [all data]
Lebedev, Smirnova, et al., 2000
Lebedev, B.V.; Smirnova, N.N.; Papkov, V.S.; Buzin, M.I.; Dubovik, I.I.,
Thermodynamics of poly(diphenylsiloxane) in the temperature region of 0-620 K,
Poly. Sci., Ser. A, 2000, 42, 10, 1111. [all data]
Smith, 1979
Smith, George W.,
Phase behavior and nucleation kinetics of Octaphenylcyclotetrasiloxane,
Phase Transitions, 1979, 1, 2, 107-129, https://doi.org/10.1080/01411597908213195
. [all data]