4-(dimethylamino)phenyl 2-methyl-2-propenoate
- Formula: C12H15NO2
- Molecular weight: 205.2530
- IUPAC Standard InChIKey: PLPRQRCZJGLVAI-UHFFFAOYSA-N
- CAS Registry Number: 54616-55-6
- Chemical structure:
View 3d structure (requires JavaScript / HTML 5) - Permanent link for this species. Use this link for bookmarking this species for future reference.

Phase change data

Data compiled by: Thermodynamics Research Center, NIST Boulder Laboratories, Chris Muzny director
Quantity | Value | Units | Method | Reference | Comment |
---|---|---|---|---|---|
Tfus | 297.5 | K | N/A | Karabaev, Abduzhaminov, et al., 1985 | Uncertainty assigned by TRC = 0.2 K |

References

Karabaev, Abduzhaminov, et al., 1985
Karabaev, M.K.; Abduzhaminov, T.P.; Kenisarin, M.M.; Saidov, A.A.,
Thermodynamics of the crystal-liquid phase transition in acrylates and methacrylates.,
Izv. Akad. Nauk Uzb. SSR Ser., Fiz-Mat. Nauk, 1985, 1985, No. 5, 74-7. [all data]