Cyclohexylamine, N-ethyl-
- Formula: C8H17N
- Molecular weight: 127.2273
- IUPAC Standard InChIKey: AGVKXDPPPSLISR-UHFFFAOYSA-N
- CAS Registry Number: 5459-93-8
- Chemical structure:
View 3d structure (requires JavaScript / HTML 5) - Other names: Cyclohexanamine, N-ethyl-; Accelerator HX; N-Cyclohexylethylamine; N-Ethylcyclohexanamine; N-Ethylcyclohexylamine; Vulkacit HX; Ethylcyclohexylamine; N-Cyclohexyl-N-ethylamine; (Ethylamino)cyclohexane; NSC 6272; cyclohexylethyl-amine

Phase change data

Data compiled as indicated in comments:
BS - Robert L. Brown and Stephen E. Stein
TRC - Thermodynamics Research Center, NIST Boulder Laboratories, Chris Muzny director
Quantity | Value | Units | Method | Reference | Comment |
---|---|---|---|---|---|
Tboil | 437.2 | K | N/A | Weast and Grasselli, 1989 | BS |
Tboil | 362.05 | K | N/A | Winternitz and Wlotzka, 1960 | Uncertainty assigned by TRC = 1. K; TRC |
Tboil | 430.65 | K | N/A | Winans and Adkins, 1932 | Uncertainty assigned by TRC = 3. K; TRC |
Quantity | Value | Units | Method | Reference | Comment |
Tfus | 229.6 | K | N/A | Anonymous, 1954 | Uncertainty assigned by TRC = 0.6 K; TRC |

Kovats' RI, non-polar column, isothermal

Column type | Active phase | Temperature (C) | I | Reference | Comment |
---|---|---|---|---|---|
Packed | Apiezon L | 100. | 996. | Golovnya, Zhuravleva, et al., 1981 | N2, Chromosorb GAW; Column length: 2.7 m |

References

Weast and Grasselli, 1989
CRC Handbook of Data on Organic Compounds, 2nd Editon, Weast,R.C and Grasselli, J.G., ed(s)., CRC Press, Inc., Boca Raton, FL, 1989, 1. [all data]
Winternitz and Wlotzka, 1960
Winternitz, F.; Wlotzka, Ch.,
Reduction of Hydroxamic Acids by Double Metallic Hydrides,
Bull. Soc. Chim. Fr., 1960, 1960, 509-15. [all data]
Winans and Adkins, 1932
Winans, C.F.; Adkins, H.,
The Alkylation of Amines as Catalyzed by Nickel,
J. Am. Chem. Soc., 1932, 54, 306. [all data]
Anonymous, 1954
Anonymous, R.,
, Am. Pet. Inst. Res. Proj. 45, Tech. Rep. 13, Ohio State Univ., 1954. [all data]
Golovnya, Zhuravleva, et al., 1981
Golovnya, R.V.; Zhuravleva, I.L.; Svetlova, N.I.; Grigor'eva, D.N.; Terenina, M.B.; Gutnik, S.B.,
Gas-chromatographic behavior of secondary isoaliphatic and alicyclic amines,
J. Anal. Chem. USSR (Engl. Transl.), 1981, 36, 4, 501-505. [all data]