Ethanol, 2-(hexylamino)-
- Formula: C8H19NO
- Molecular weight: 145.2426
- IUPAC Standard InChIKey: MCIKGVLBLIZYRY-UHFFFAOYSA-N
- CAS Registry Number: 54596-69-9
- Chemical structure:
View 3d structure (requires JavaScript / HTML 5) - Other names: 2-hexylaminoethanol

Phase change data

Data compiled by: Robert L. Brown and Stephen E. Stein
Reduced pressure boiling point
Tboil (K) | Pressure (bar) | Reference |
---|---|---|
394. to 395. | 0.019 | Frinton Laboratories Inc., 1986 |

Kovats' RI, non-polar column, isothermal

Column type | Active phase | Temperature (C) | I | Reference | Comment |
---|---|---|---|---|---|
Packed | SE-30 | 170. | 1197. | Voelkel, 1987 | He, Chromaton N Super (75-100 mesh); Column length: 1. m |

References

Frinton Laboratories Inc., 1986
Frinton Laboratories Inc.,
Catalog Number 11, Frinton Laboratories Inc., Vineland, NJ, 1986, 99. [all data]
Voelkel, 1987
Voelkel, A.,
Retention Indices and Thermodynamic Functions of Solution for Model Non-Ionic Surfactants in Standard Stationary Phases Determined by Gas Chromatography,
J. Chromatogr., 1987, 387, 95-104, https://doi.org/10.1016/S0021-9673(01)94516-9
. [all data]