3-(Hexylthio)-1,2-propanediol
- Formula: C9H20O2S
- Molecular weight: 192.319
- IUPAC Standard InChIKey: IKXQTVNEUUQICP-UHFFFAOYSA-N
- CAS Registry Number: 54581-77-0
- Chemical structure:
View 3d structure (requires JavaScript / HTML 5) - Permanent link for this species. Use this link for bookmarking this species for future reference.

Phase change data

Data compiled as indicated in comments:
TRC - Thermodynamics Research Center, NIST Boulder Laboratories, Chris Muzny director
AC - William E. Acree, Jr., James S. Chickos
Quantity | Value | Units | Method | Reference | Comment |
---|---|---|---|---|---|
Tfus | 289. | K | N/A | van Doren and van der Geest, 1990 | Uncertainty assigned by TRC = 2. K; TRC |
Enthalpy of fusion
ΔfusH (kJ/mol) | Temperature (K) | Method | Reference | Comment |
---|---|---|---|---|
48.5 | 290.8 | DSC | Acree, 1993 | See also van Doren, van der Geest, et al., 2010.; AC |

References

van Doren and van der Geest, 1990
van Doren, H.A.; van der Geest, R.,
A comparative study of the liquid-crystalline behavior of three homologous series of 1,2-propanediol derivatives,
Recl.: J. R. Neth. Chem. Soc., 1990, 109, 197. [all data]
Acree, 1993
Acree, William E.,
Thermodynamic properties of organic compounds,
Thermochimica Acta, 1993, 219, 97-104, https://doi.org/10.1016/0040-6031(93)80486-T
. [all data]
van Doren, van der Geest, et al., 2010
van Doren, Henk A.; van der Geest, Ralph; Kellogg, Richard M.; Wynberg, Hans,
A comparative study of the liquid-crystalline behavior of three homologous series of 1,2-propanediol derivatives,
Recl. Trav. Chim. Pays-Bas, 2010, 109, 3, 197-203, https://doi.org/10.1002/recl.19901090312
. [all data]