Di-tert-butyl-isopropylmethanol
- Formula: C12H26O
- Molecular weight: 186.3342
- IUPAC Standard InChIKey: DXYPGMZJNUIZMU-UHFFFAOYSA-N
- CAS Registry Number: 5457-42-1
- Chemical structure:
View 3d structure (requires JavaScript / HTML 5) - Permanent link for this species. Use this link for bookmarking this species for future reference.

Phase change data

Data compiled as indicated in comments:
TRC - Thermodynamics Research Center, NIST Boulder Laboratories, Chris Muzny director
AC - William E. Acree, Jr., James S. Chickos
Quantity | Value | Units | Method | Reference | Comment |
---|---|---|---|---|---|
Tboil | 507.15 | K | N/A | Smith and Creitz, 1951 | Uncertainty assigned by TRC = 3. K; TRC |
Quantity | Value | Units | Method | Reference | Comment |
ΔvapH° | 57.0 ± 0.8 | kJ/mol | GS | Verevkin, 1998 | Based on data from 317. to 348. K.; AC |
Quantity | Value | Units | Method | Reference | Comment |
ΔsubH° | 59.3 ± 0.8 | kJ/mol | GS | Verevkin, 1998, 2 | Based on data from 274. to 308. K.; AC |
Enthalpy of vaporization
ΔvapH (kJ/mol) | Temperature (K) | Method | Reference | Comment |
---|---|---|---|---|
54.9 ± 0.8 | 333. | GS | Verevkin, 1998 | Based on data from 317. to 348. K.; AC |
Enthalpy of sublimation
ΔsubH (kJ/mol) | Temperature (K) | Method | Reference | Comment |
---|---|---|---|---|
59.7 ± 0.8 | 291. | GS | Verevkin, 1998, 2 | Based on data from 274. to 308. K.; AC |
Enthalpy of fusion
ΔfusH (kJ/mol) | Temperature (K) | Method | Reference | Comment |
---|---|---|---|---|
2.09 | 314. | DSC | Verevkin, 1998, 2 | Compound likely has an unmeasured solid phase transition.; AC |

References

Smith and Creitz, 1951
Smith, F.A.; Creitz, E.C.,
Infrared studies of association in eleven alcohols,
J. Res. Natl. Bur. Stand. (U. S.), 1951, 46, 145. [all data]
Verevkin, 1998
Verevkin, Sergey P.,
Thermochemistry of phenols: experimental standard molar enthalpies of formation of 2-phenylphenol, 4-phenylphenol, 2,6-diphenylphenol, and 2,2´- and 4,4´-dihydroxybiphenyl,
The Journal of Chemical Thermodynamics, 1998, 30, 3, 389-396, https://doi.org/10.1006/jcht.1997.0316
. [all data]
Verevkin, 1998, 2
Verevkin, Sergey P.,
Structural Chemistry, 1998, 9, 5, 375-382, https://doi.org/10.1023/A:1022471228499
. [all data]