2,2,4-Trimethyl-3-isopropyl-3-pentanol
- Formula: C11H24O
- Molecular weight: 172.3077
- IUPAC Standard InChIKey: SBZXSSDGPXFNPD-UHFFFAOYSA-N
- CAS Registry Number: 5457-41-0
- Chemical structure:
View 3d structure (requires JavaScript / HTML 5) - Permanent link for this species. Use this link for bookmarking this species for future reference.

Phase change data

Data compiled as indicated in comments:
TRC - Thermodynamics Research Center, NIST Boulder Laboratories, Chris Muzny director
AC - William E. Acree, Jr., James S. Chickos
Quantity | Value | Units | Method | Reference | Comment |
---|---|---|---|---|---|
Tboil | 488.55 | K | N/A | Smith and Creitz, 1951 | Uncertainty assigned by TRC = 4. K; TRC |
Enthalpy of vaporization
ΔvapH (kJ/mol) | Temperature (K) | Reference | Comment |
---|---|---|---|
67.1 | 336. | Wilhoit and Zwolinski, 1973 | Based on data from 321. to 458. K.; AC |

References

Smith and Creitz, 1951
Smith, F.A.; Creitz, E.C.,
Infrared studies of association in eleven alcohols,
J. Res. Natl. Bur. Stand. (U. S.), 1951, 46, 145. [all data]
Wilhoit and Zwolinski, 1973
Wilhoit, R.C.; Zwolinski, B.J.,
Physical and thermodynamic properties of aliphatic alcohols,
J. Phys. Chem. Ref. Data Suppl., 1973, 1, 2, 1. [all data]