cis-3-Methylcyclohexanol
- Formula: C7H14O
- Molecular weight: 114.1855
- IUPAC Standard InChIKey: HTSABYAWKQAHBT-NKWVEPMBSA-N
- CAS Registry Number: 5454-79-5
- Chemical structure:
View 3d structure (requires JavaScript / HTML 5) - Stereoisomers:
- Other names: Cyclohexanol, 3-methyl-, cis-; 3-Methylcyclohexanol, (Z)-; 3-Methyl cyclohexanol, cis; 3-Methylcyclohexanol

Condensed phase thermochemistry data

Data compiled by: Hussein Y. Afeefy, Joel F. Liebman, and Stephen E. Stein
Quantity | Value | Units | Method | Reference | Comment |
---|---|---|---|---|---|
ΔfH°liquid | -399.9 | kJ/mol | Ccb | Skita and Faust, 1931 | Authors' ΔU=-9119.2±7 cal/g |
Quantity | Value | Units | Method | Reference | Comment |
ΔcH°liquid | -4334.7 ± 3.3 | kJ/mol | Ccb | Eliel and Haber, 1958 | Corresponding ΔfHºliquid = -420.62 kJ/mol (simple calculation by NIST; no Washburn corrections) |
ΔcH°liquid | -4355.5 ± 3.3 | kJ/mol | Ccb | Skita and Faust, 1931 | Authors' ΔU=-9119.2±7 cal/g; Corresponding ΔfHºliquid = -399.9 kJ/mol (simple calculation by NIST; no Washburn corrections) |

Reaction thermochemistry data

Data compiled by: Hussein Y. Afeefy, Joel F. Liebman, and Stephen E. Stein
Individual Reactions
By formula: C7H14O = C7H14O
Quantity | Value | Units | Method | Reference | Comment |
---|---|---|---|---|---|
ΔrH° | -3.8 ± 0.8 | kJ/mol | Eqk | Kabo and Frenkel, 1983 | gas phase |
ΔrH° | -3.8 ± 0.8 | kJ/mol | Eqk | Frenkel and Kabo, 1979 | liquid phase |
By formula: C7H14O = H2 + C7H12O
Quantity | Value | Units | Method | Reference | Comment |
---|---|---|---|---|---|
ΔrH° | 65.7 ± 2.1 | kJ/mol | Eqk | Fedoseenko, Yursha, et al., 1983 | gas phase; At 488 K |

Kovats' RI, non-polar column, isothermal

Column type | Active phase | Temperature (C) | I | Reference | Comment |
---|---|---|---|---|---|
Packed | Apiezon L | 130. | 964. | Paris and Alexandre, 1972 | Chromosorb W AW |

Normal alkane RI, polar column, custom temperature program

Column type | Active phase | I | Reference | Comment |
---|---|---|---|---|
Capillary | DB-Wax | 1482. | Peng, Yang, et al., 1991 | Program: not specified |

References

Skita and Faust, 1931
Skita, A.; Faust, W.,
474. Uber die Bildungs-Geschwindigkeiten der stereomeren Methyl-cyclohexanole,
Ber., 1931, 64, 2878-2892. [all data]
Eliel and Haber, 1958
Eliel, E.L.; Haber, R.G.,
The boiling points of the methylcyclohexanols-an exception to the conformational rule,
J. Org. Chem., 1958, 23, 2041. [all data]
Kabo and Frenkel, 1983
Kabo, G.J.; Frenkel, M.L.,
Thermodynamics of diastereomeric transformations of alcohols with different carbon-skeleton structures,
J. Chem. Thermodyn., 1983, 15, 377-381. [all data]
Frenkel and Kabo, 1979
Frenkel, M.L.; Kabo, G.Ya.,
Thermodynamics of stereoisomeric transformations of methylcyclohexanols,
Termodin. Org. Soedin., 1979, 104-106. [all data]
Fedoseenko, Yursha, et al., 1983
Fedoseenko, V.I.; Yursha, I.A.; Kabo, G.Ya.,
Equilibrium and thermodynamics of cyclohexanol dehydrogenation reactions,
Dokl. Akad. Nauk BSSR, 1983, 27, 926-929. [all data]
Paris and Alexandre, 1972
Paris, C.; Alexandre, P.,
Stereochemical Investigation of Cyclohexane and Terpene Compounds by Gas Chromatography,
J. Chromatogr. Sci., 1972, 10, 6, 402-411, https://doi.org/10.1093/chromsci/10.6.402
. [all data]
Peng, Yang, et al., 1991
Peng, C.T.; Yang, Z.C.; Ding, S.F.,
Prediction of rentention idexes. II. Structure-retention index relationship on polar columns,
J. Chromatogr., 1991, 586, 1, 85-112, https://doi.org/10.1016/0021-9673(91)80028-F
. [all data]