Butanoic acid, decyl ester
- Formula: C14H28O2
- Molecular weight: 228.3709
- IUPAC Standard InChIKey: PUCQHFICPFUPKW-UHFFFAOYSA-N
- CAS Registry Number: 5454-09-1
- Chemical structure:
View 3d structure (requires JavaScript / HTML 5) - Other names: Butyric acid, decyl ester; Decyl butyrate; ENT 30734; Decyl butanoate; n-Decyl butanoate

Phase change data

Data compiled by: Thermodynamics Research Center, NIST Boulder Laboratories, Chris Muzny director
Quantity | Value | Units | Method | Reference | Comment |
---|---|---|---|---|---|
Tboil | 543. | K | N/A | Hoffmann, 1959 | Uncertainty assigned by TRC = 3. K; may not be measured |
Tboil | 543. | K | N/A | Morel, 1952 | Uncertainty assigned by TRC = 6. K |

Kovats' RI, non-polar column, isothermal

View large format table.

Column type Active phase Temperature (C) I Reference Comment
CapillarySE-30120.1590.Haken and Korhonen, 1985N2; Column length: 25. m; Column diameter: 0.33 mm
CapillarySE-30140.1566.Haken and Korhonen, 1985N2; Column length: 25. m; Column diameter: 0.33 mm
CapillarySE-30160.1564.Haken and Korhonen, 1985N2; Column length: 25. m; Column diameter: 0.33 mm
CapillarySE-30180.1565.Haken and Korhonen, 1985N2; Column length: 25. m; Column diameter: 0.33 mm
CapillarySE-30200.1565.Haken and Korhonen, 1985N2; Column length: 25. m; Column diameter: 0.33 mm
CapillaryOV-101200.1571.Komárek, Hornová, et al., 1983Column length: 15. m; Column diameter: 0.22 mm
PackedSE-30180.1568.Zarazir, Chovin, et al., 1970Chromosorb W; Column length: 2. m

Kovats' RI, polar column, isothermal

View large format table.

Column type Active phase Temperature (C) I Reference Comment
PackedCarbowax 20M180.1822.Zarazir, Chovin, et al., 1970Chromosorb W; Column length: 2. m

Van Den Dool and Kratz RI, non-polar column, custom temperature program

View large format table.

Column type Active phase I Reference Comment
CapillaryBPX-51597.Owens J.D., Allagheny N., et al., 199750. m/0.32 mm/0.5 μm, He; Program: OC => 60C/min => 60C(5min) => 4C/min => 250C(20min)

Normal alkane RI, non-polar column, temperature ramp

View large format table.

Column type Active phase I Reference Comment
CapillaryUltra-11573.Okumura, 199125. m/0.32 mm/0.25 μm, He, 3. K/min; Tstart: 80. C; Tend: 260. C

Normal alkane RI, polar column, temperature ramp

View large format table.

Column type Active phase I Reference Comment
CapillaryCarbowax 20M1830.Kafkas and Paydas, 200725. m/0.25 mm/0.40 μm, Helium, 5. K/min, 260. C @ 40. min; Tstart: 60. C
CapillaryDB-Wax1807.Werkhoff, Güntert, et al., 199860. m/0.32 mm/0.25 μm, H2, 3. K/min; Tstart: 60. C; Tend: 220. C

References

Hoffmann, 1959
Hoffmann, W.L.,
Riechst. Aromen, 1959, 9, 273. [all data]
Morel, 1952
Morel, C.,
Soap, Perfum. Cosmet., Yearb. Buyers' Guide, 1952, 25, 512-5. [all data]